{"text_format":"1","workbook":"xlsx","n_sheets":3,"sheets":["Collateral Tables","Note Balance","Cumulative Defaults"],"not_rendered":{"charts":1,"images":0,"macros":1,"external_links":7,"defined_names":24,"comments":1,"pivot_tables":0},"unopened":[],"bounds":{"document_bytes":16777216,"sheet_cells":100000,"rows_first":2000,"rows_last":500,"rows_between":2000,"halvings":0,"cell_chars":16384,"cell_head_chars":4096},"cells_cut":0,"cells_raw":0,"read":"whole","date_system":"1900"}

{"sheet":"Collateral Tables","index":0,"n_rows":247,"n_cols":15,"rows_kept":247,"cut":false,"hidden":false,"merged":[]}
[null,"CNH CAPITAL AUSTRALIA RECEIVABLES TRUST SERIES 2016-1 (TERM DEAL)"]
[null,"COLLATERAL DATA TABLES"]
[]
[null,"OUTSTANDING RECEIVABLES",null,null,"2016-10-31",null,null,null,"2016-07-31",null,null,null,"2016-04-30"]
[]
[null,"Opening Balance",null,null,{"$f":"I13","v":253371003.93000007},null,null,null,275076134.53000009,null,null,null,349999833.42000002]
[null,"Principal Repayments - Scheduled",null,null,{"$f":"MIN('[1]16 Nov 16'!$H23,SUM([2]Sheet1!$B$3,[3]Sheet1!$B$3,[4]Sheet1!$B$3))","v":13038858.939999998},null,null,null,18368178.68,null,null,null,70539694.680000007]
[null,"Principal Repayments - Unscheduled",null,null,{"$f":"'[1]16 Nov 16'!H23-'Collateral Tables'!E7","v":7347080.2000000104},null,null,null,2981303.9900000058,null,null,null,4299937.9999999255]
[{"$f":"SUM(I9:M9)","v":439714.14},"Charge-Offs",null,null,{"$f":"'[1]16 Nov 16'!$H37","v":0},null,null,null,355647.93,null,null,null,84066.21]
[null,"Reinstatements"]
[null,"New Receivables Purchased"]
[null,"Non Cash Change in Receivables"]
[null,"Closing Balance",null,null,{"$f":"E6-E7-E8-E9+E10+E11-E12","v":232985064.79000005},null,null,null,253371003.93000007,null,null,null,275076134.53000009]
[]
[null,"PORTFOLIO STATISTICS"]
[]
[null,"Summary"]
[null,"Number of contracts",null,null,{"$f":"[5]Summary!$B$4","v":3133},null,null,null,3263,null,null,null,3422]
[null,"Average Dollar Value of Loans",null,null,{"$f":"[5]Summary!$B$6","v":74364.846725183495},null,null,null,77649.710061293183,null,null,null,80384.609739918029]
[null,"Number of contracts closed during the Quarter",null,null,{"$f":"[5]Summary!$B$19","v":130},null,null,null,157,null,null,null,216]
[null,"Dollar value of contracts closed during the Quarter",null,null,{"$f":"[5]Summary!$B$20","v":8722235.7299999949},null,null,null,5997812.8599999985,null,null,null,10129289.880000003]
[]
[{"$f":"SUM(M23)","v":0},"Dollar Value of Recoveries from Collateral",null,null,{"$f":"[5]Summary!$C$16","v":90664.72000000003},null,null,null,-8677.59,null,null,null,0]
[null,"Dollar Value of Recoveries from Other Sources",null,null,0,null,null,null,0,null,null,null,0]
[]
[null,"Average Term of Contracts (Months)",null,null,{"$f":"[6]Sheet1!$W$3135","v":51.221268983771495},null,null,null,50.905018498380905,null,null,null,50.602561692977268]
[null,"Average Term to Maturity (Months)",null,null,{"$f":"[6]Sheet1!$X$3135","v":28.796062261189039},null,null,null,31.261824556602878,null,null,null,33.580143025830573]
[null,"Average Residual / Balloon Payment *",null,null,{"$f":"[6]Sheet1!$AI$3135","v":1.9947715214700443E-2},null,null,null,2.2629991788590827E-2,null,null,null,2.4040809082651878E-2]
[null,"Average Seasoning (Months)",null,null,{"$f":"E26-E27","v":22.425206722582455},null,null,null,19.643193941778026,null,null,null,17.022418667146695]
[null,"Average Dollar Value of Individual Assets",null,null,{"$f":"E19/E18","v":23.73598682578471},null,null,null,23.797030358962054,null,null,null,23.490534698982476]
[null,"Weighted Average Interest Rate",null,null,{"$f":"[6]Sheet1!$AA$3135/100","v":3.6244089599937843E-2},null,null,null,3.6462237991813522E-2,null,null,null,3.6655471442132145E-2]
[]
[null,"Payment in Arrears"]
["1. 0 - 30 Days","0 - 30 Days",null,null,{"$f":"IFERROR(VLOOKUP($A34,'[7]Arrears Reporting'!$A$1:$D$6,3,FALSE),0)","v":3124},{"$f":"IFERROR(VLOOKUP($A34,'[7]Arrears Reporting'!$A$1:$D$5,2,FALSE),0)","v":20933.35999999999},{"$f":"F34/F$50","v":8.9848506035647343E-5},null,3255,120639.01000000001,4.7613581715660603E-4,null,3409,279917.05,1.0175984567991395E-3]
["2. 31 - 60 Days","31 - 60 Days",null,null,{"$f":"IFERROR(VLOOKUP($A35,'[7]Arrears Reporting'!$A$1:$D$6,3,FALSE),0)","v":6},{"$f":"IFERROR(VLOOKUP($A35,'[7]Arrears Reporting'!$A$1:$D$5,2,FALSE),0)","v":106352.71000000002},{"$f":"F35/F$50","v":4.5647865924736678E-4},null,3,46074.110000000015,1.8184444662313923E-4,null,8,230113.48,8.3654469113860581E-4]
["3. 61 - 90 Days","61 - 90 Days",null,null,{"$f":"IFERROR(VLOOKUP($A36,'[7]Arrears Reporting'!$A$1:$D$6,3,FALSE),0)","v":0},{"$f":"IFERROR(VLOOKUP($A36,'[7]Arrears Reporting'!$A$1:$D$5,2,FALSE),0)","v":0},0,null,4,60199.999999999971,2.3759624845087562E-4,null,3,35237.550000000097,1.2810108030712178E-4]
["4. 91 - 120 Days","91 - 120 Days",null,null,{"$f":"IFERROR(VLOOKUP($A37,'[7]Arrears Reporting'!$A$1:$D$6,3,FALSE),0)","v":3},{"$f":"IFERROR(VLOOKUP($A37,'[7]Arrears Reporting'!$A$1:$D$5,2,FALSE),0)","v":19683.799999999992},8.4485243797673918E-5,null,0,0,0,null,1,48099.140000000007,1.7485755382662749E-4]
["5. 121 - 150 Days","121 - 150 Days",null,null,{"$f":"IFERROR(VLOOKUP($A38,'[7]Arrears Reporting'!$A$1:$D$6,3,FALSE),0)","v":0},{"$f":"IFERROR(VLOOKUP($A38,'[7]Arrears Reporting'!$A$1:$D$5,2,FALSE),0)","v":0},0,null,1,5363.4499999999989,2.1168365427804805E-5,null,1,30045.720000000012,1.09226923852688E-4]
["6. 151 - 180 Days","151 - 180 Days",null,null,{"$f":"IFERROR(VLOOKUP($A39,'[7]Arrears Reporting'!$A$1:$D$6,3,FALSE),0)","v":0},{"$f":"IFERROR(VLOOKUP($A39,'[7]Arrears Reporting'!$A$1:$D$5,2,FALSE),0)","v":0},0,null,0,0,0,null,0,0,0]
[null,"Total",null,null,{"$f":"SUM(E34:E39)","v":3133},{"$f":"SUM(F34:F39)","v":146969.87},{"$f":"SUM(G34:G39)","v":6.3081240908068807E-4},null,3263,232276.57,9.1674487765842569E-4,null,3422,623412.94000000006,2.2663287059241826E-3]
[null,"* Expressed as a % of Aggreg. Rec. closing bal.",null,null,null,"> 30 days",{"$f":"SUM(G35:G39)","v":5.4096390304504065E-4},null,null,"> 30 days",4.406090605018196E-4,null,null,"> 30 days",1.2487302491250431E-3]
[]
[" 0 - 30 Days","Account Balances in Arrears"]
["1. 0 - 30 Days","0 - 30 Days",null,null,{"$f":"IFERROR(VLOOKUP($A44,'[7]Arrears Reporting'!$A$1:$D$6,3,FALSE),0)","v":3124},{"$f":"IFERROR(VLOOKUP($A44,'[7]Arrears Reporting'!$A$1:$D$6,4,FALSE),0)","v":232540319.81999987},{"$f":"F44/F$50","v":0.99809110094502895},null,3255,252870428.10999963,0.99802433659639167,null,3409,273901148.7699995,0.99572850708402028]
["2. 31 - 60 Days","31 - 60 Days",null,null,{"$f":"IFERROR(VLOOKUP($A45,'[7]Arrears Reporting'!$A$1:$D$6,3,FALSE),0)","v":6},{"$f":"IFERROR(VLOOKUP($A45,'[7]Arrears Reporting'!$A$1:$D$6,4,FALSE),0)","v":225774.02000000002},{"$f":"F45/F$50","v":9.6904932598791476E-4},null,3,122576.48000000001,4.8378258797863457E-4,null,8,698753.64,2.5402190604208695E-3]
["3. 61 - 90 Days","61 - 90 Days",null,null,{"$f":"IFERROR(VLOOKUP($A46,'[7]Arrears Reporting'!$A$1:$D$6,3,FALSE),0)","v":0},{"$f":"IFERROR(VLOOKUP($A46,'[7]Arrears Reporting'!$A$1:$D$6,4,FALSE),0)","v":0},0,null,4,366338.57999999996,1.4458583433691198E-3,null,3,107754.56,3.9172631309550559E-4]
["4. 91 - 120 Days","91 - 120 Days",null,null,{"$f":"IFERROR(VLOOKUP($A47,'[7]Arrears Reporting'!$A$1:$D$6,3,FALSE),0)","v":3},{"$f":"IFERROR(VLOOKUP($A47,'[7]Arrears Reporting'!$A$1:$D$6,4,FALSE),0)","v":218970.95},{"$f":"F47/F$50","v":9.3984972898313707E-4},null,0,0,0,null,1,84424.18,3.0691204871061899E-4]
["5. 121 - 150 Days","121 - 150 Days",null,null,{"$f":"IFERROR(VLOOKUP($A48,'[7]Arrears Reporting'!$A$1:$D$6,3,FALSE),0)","v":0},{"$f":"IFERROR(VLOOKUP($A48,'[7]Arrears Reporting'!$A$1:$D$6,4,FALSE),0)","v":0},{"$f":"F48/F$50","v":0},null,1,11660.76,4.6022472260565345E-5,null,1,284053.38,1.0326354937528085E-3]
["6. 151 - 180 Days","151 - 180 Days",null,null,{"$f":"IFERROR(VLOOKUP($A49,'[7]Arrears Reporting'!$A$1:$D$6,3,FALSE),0)","v":0},{"$f":"IFERROR(VLOOKUP($A49,'[7]Arrears Reporting'!$A$1:$D$6,4,FALSE),0)","v":0},{"$f":"F49/F$50","v":0},null,0,0,0,null,0,0,0]
[null,"Total",null,null,{"$f":"SUM(E44:E49)","v":3133},{"$f":"SUM(F44:F49)","v":232985064.78999987},{"$f":"SUM(G44:G49)","v":1},null,3263,253371003.92999962,1,null,3422,275076134.52999949,1]
["NSW",null,null,null,null,"> 30 days",{"$f":"SUM(G45:G49)","v":1.9088990549710519E-3},null,null,"> 30 days",1.9756634036083198E-3,null,null,"> 30 days",4.2714929159798024E-3]
[null,null,null,null,null,">90 days",{"$f":"SUM(G47:G49)","v":9.3984972898313707E-4},null,null,">90 days",4.6022472260565345E-5,null,null,">90 days",1.3395475424634274E-3]
[]
["VIC","Geographic Distribution"]
["NSW","New South Wales",null,null,{"$f":"F55/F$63","v":0.28479963189832763},{"$f":"IFERROR(VLOOKUP($A$55,'[7]Geographic '!$A$1:$C$10,3,FALSE),0)","v":66354060.690000072},null,null,0.29110503718246078,73757575.520000115,null,null,0.29705376436823705,81712401.250000164]
["VIC","Victoria",null,null,{"$f":"F56/F$63","v":0.17518044582294545},{"$f":"IFERROR(VLOOKUP($A$56,'[7]Geographic '!$A$1:$C$10,3,FALSE),0)","v":40814427.520000063},null,null,0.17529086308656849,44413621.960000068,null,null,0.18022488506574988,49575564.730000041]
["QLD","Queensland",null,null,0.10433737450900916,{"$f":"IFERROR(VLOOKUP($A$57,'[7]Geographic '!$A$1:$C$10,3,FALSE),0)","v":24309049.960000016},null,null,0.11345624631120736,28746523.02999999,null,null,0.11757327303315286,32341601.470000003]
["SA","South Australia",null,null,0.19173873256753657,{"$f":"IFERROR(VLOOKUP($A$58,'[7]Geographic '!$A$1:$C$10,3,FALSE),0)","v":44672261.030000031},null,null,0.18459924361716598,46772095.680000022,null,null,0.17919394619319157,49291978.049999982]
["NT","Northern Territory",null,null,4.5433307107221594E-4,{"$f":"IFERROR(VLOOKUP($A$59,'[7]Geographic '!$A$1:$C$10,3,FALSE),0)","v":105852.81999999999},null,null,4.1777795548082671E-4,105852.81999999999,null,null,3.848128089369219E-4,105852.81999999999]
["ACT","Australian Capital Territory",null,null,2.1620857991650131E-4,{"$f":"IFERROR(VLOOKUP($A$60,'[7]Geographic '!$A$1:$C$10,3,FALSE),0)","v":50373.369999999995},null,null,2.2047574163392924E-4,55862.159999999989,null,null,2.2276559943922353E-4,61277.499999999993]
["TAS","Tasmania",null,null,8.5949311034376093E-3,{"$f":"IFERROR(VLOOKUP($A$61,'[7]Geographic '!$A$1:$C$10,3,FALSE),0)","v":2002490.5799999994},null,null,8.8499200193384916E-3,2242313.12,null,null,9.7943024559484972E-3,2694178.8600000003]
["WA","Western Australia",null,null,0.23467834244775482,{"$f":"IFERROR(VLOOKUP($A$62,'[7]Geographic '!$A$1:$C$10,3,FALSE),0)","v":54676548.820000008},null,null,0.22606043608614426,57277159.640000015,null,null,0.21555225047534396,59293279.850000016]
[null,"Total",null,null,{"$f":"SUM(E55:E62)","v":1},{"$f":"SUM(F55:F62)","v":232985064.7900002},null,null,1.0000000000000002,253371003.93000019,null,null,0.99999999999999989,275076134.53000021]
["AG",null,null,null,null,null,{"$f":"E13-F63","v":0},null,null,null,0,null,null,null,275076134.53000009]
["CE","Top Industry Distribution"]
["AGRICULTURAL MACHINERY","Agricultural",null,null,{"$f":"F66/F$69","v":0.98745834398168941},{"$f":"IFERROR(VLOOKUP(A66,'[7]Top Industry'!$A$1:$C$5,3,FALSE),)","v":230063046.24999982},null,null,0.98669367201571556,249999566.24999967,null,null,0.9852200432911179,271010521.1699996]
["CONSTRUCTION EQUIPMENT","Construction",null,null,{"$f":"F67/F$69","v":1.2541656018310655E-2},{"$f":"IFERROR(VLOOKUP($A$67,'[7]Top Industry'!$A$1:$C$5,3,FALSE),)","v":2922018.5399999991},null,null,1.3306327984284449E-2,3371437.6799999997,null,null,1.4779956708882014E-2,4065613.3599999994]
["MOTOR VEHICLE - AG","Motor Vehicle AG",null,null,{"$f":"F68/F$69","v":0},{"$f":"IFERROR(VLOOKUP($A$68,'[7]Top Industry'!$A$1:$C$5,3,FALSE),)","v":0},null,null,0,0,null,null,0,0]
[null,"Total",null,null,{"$f":"SUM(E66:E68)","v":1},{"$f":"SUM(F66:F68)","v":232985064.78999981},{"$f":"F63-F69","v":3.8743019104003906E-7},null,1,253371003.92999968,5.0663948059082031E-7,null,0.99999999999999989,275076134.52999961,-275076134.52999961]
["COMBINE"]
["40-100 HP TRACTOR","Collateral Types"]
["100<140 HP TRACTOR","100-140 HP TRACTOR",null,null,{"$f":"IFERROR(F72/F$107,0)","v":0.10117027102679638},{"$f":"IFERROR(VLOOKUP($A$72,[7]Collateral!$A$1:$C$30,3,FALSE),\"\")","v":23571162.150000006},null,null,0.1031342088663761,26131218.040000021,null,null,0.10702894513296701,29441108.51000002]
["4 EWD Tractors","4 EWD Tractors",null,null,0.11167033806845429,{"$f":"IFERROR(VLOOKUP($A$73,[7]Collateral!$A$1:$C$30,3,FALSE),\"\")","v":26017520.950000018},null,null,0.1081672270106003,27406438.900000013,null,null,0.10816969673083333,29754902.050000008]
["40<100 HP Tractor","40<100 HP Tractor",null,null,{"$f":"IFERROR(F74/F$107,0)","v":0},{"$f":"IFERROR(VLOOKUP($A$74,[7]Collateral!$A$1:$C$30,3,FALSE),\"\")","v":""},null,null,0,"",null,null,0,""]
["40<60 HP TRACTOR","40-60 HP TRACTOR",null,null,{"$f":"IFERROR(F75/F$107,0)","v":6.8241157922850713E-3},{"$f":"IFERROR(VLOOKUP($A$75,[7]Collateral!$A$1:$C$30,3,FALSE),\"\")","v":1589917.0599999991},null,null,7.5032547154654967E-3,1901107.1799999995,null,null,8.2621937518615757E-3,2272732.3199999998]
["4WD VEHICLE","4WD VEHICLE",null,null,6.1197012833639659E-5,{"$f":"IFERROR(VLOOKUP($A$76,[7]Collateral!$A$1:$C$30,3,FALSE),\"\")","v":14257.989999999994},null,null,7.2201829397392775E-5,18293.849999999995,null,null,8.1090059078052425E-5,22305.939999999995]
["60<100 HP TRACTOR","60-100 HP TRACTOR",null,null,6.0238977775893862E-2,{"$f":"IFERROR(VLOOKUP($A$77,[7]Collateral!$A$1:$C$30,3,FALSE),\"\")","v":14034782.139999997},null,null,6.3897213252045268E-2,16189701.07000001,null,null,6.7368036277167365E-2,18531339.010000009]
["Backhoes","Backhoes",null,null,5.0477553188228133E-4,{"$f":"IFERROR(VLOOKUP($A$78,[7]Collateral!$A$1:$C$30,3,FALSE),\"\")","v":117605.15999999999},null,null,5.3357810445172499E-4,135193.21999999997,null,null,5.5525191329654385E-4,152736.54999999999]
["BALERS, WINDROWERS, MOWERS, RAKES","BALERS, WINDROWERS, MOWERS, RAKES",null,null,3.6830440044448312E-2,{"$f":"IFERROR(VLOOKUP($A$79,[7]Collateral!$A$1:$C$30,3,FALSE),\"\")","v":8580942.4599999972},null,null,3.8811712735356309E-2,9833762.6199999955,null,null,3.8551025293848094E-2,10604467.01999999]
["QUAD BIKES","QUAD BIKES",null,null,2.167267676385721E-5,{"$f":"IFERROR(VLOOKUP($A$80,[7]Collateral!$A$1:$C$30,3,FALSE),\"\")","v":5049.409999999998},null,null,3.2280489373833919E-5,8178.9399999999969,null,null,3.3626544941110479E-5,9249.8599999999951]
{"$rows_left_out":168}
{"sheet":"Note Balance","index":1,"n_rows":64,"n_cols":9,"rows_kept":64,"cut":false,"hidden":false,"merged":[]}
[null,null,"TOTAL NOTE BALANCES"]
[null,null,null,"Total Notes","Class A1 Notes","Class A2 Notes","Class B Notes","Class C Notes","Class D Notes"]
[null,null,"Initial Invested Amount",350000000,105000000,198000000,11300000,10500000,6200000]
["(a)",null,"Invested Amount as at Previous Payment Date:  3 March 2016",350000000,105000000,198000000,11300000,10500000,6200000]
["(b)",null,"Stated Amount as at Previous Payment Date:  3 March 2016",350000000,105000000,198000000,11300000,10500000,6200000]
["(d)",null,"Principal Payments to Noteholders on Payment Date",350000000,74839799.260000005,0,0,0,0]
[null,null,"Gross Aggregate Charge-Offs",0,0,0,0,0,0]
[null,null,"Gross Aggregate Reinstatements of charge-offs",0,0,0,0,0,0]
["(e)",null,"Aggregate Charge-Offs for this Collection Period",84066.21,0,0,0,0,0]
["(f)",null,"Reinstatements relating to Charge-offs that have occurred this Collection Period",0,0,0,0,0,0]
[null,null,"Aggregate Carry Over Charge-offs not previously reinstated",0,0,0,0,0,0]
[null,null,"Reinstatements of Carry Over Charge-offs not previously reinstated",0,0,0,0,0,0]
[null,null,"Aggregate Charge-Offs not reinstated and to be carried over to next period",84066.21,0,0,0,0,0]
[null,null,"Invested Amount as at Payment Date:  16 May 2016",275160200.74000001,30160200.739999995,198000000,11300000,10500000,6200000]
[null,null,"Stated Amount as at Payment Date:  16 May 2016",275076134.53000003,30160200.739999995,198000000,11300000,10500000,6200000]
[null,null,"Bond Factor at Payment Date:  16 May 2016",null,0.28724000704761898,1,1,1,1]
[null,null,"Coupon Margin",null,6.0000000000000001E-3,1.2999999999999999E-2,0.02,2.5000000000000001E-2,2.4500000000000001E-2]
[null,null,"Coupon Rate (3 month BBSW + margin)",null,2.9100000000000001E-2,3.61E-2,4.3099999999999999E-2,4.8100000000000004E-2,4.7600000000000003E-2]
[null,null,"Days in Coupon Period",null,74,74,74,74,74]
[null,null,"Coupon Entitlement to be paid out on the current Payment Date: 16 May 2016",null,619471.23,1449143.01,98740.33,102393.7,59832.55]
[]
[]
[null,null,"TOTAL NOTE BALANCES"]
[null,null,null,"Total Notes","Class A1 Notes","Class A2 Notes","Class B Notes","Class C Notes","Class D Notes"]
[null,null,"Initial Invested Amount",350000000,105000000,198000000,11300000,10500000,6200000]
["(a)",null,"Invested Amount as at Previous Payment Date:  16 May 2016",350000000,30160200.739999995,198000000,11300000,10500000,6200000]
["(b)",null,"Stated Amount as at Previous Payment Date:  16 May 2016",275160200.74000001,30160200.739999995,198000000,11300000,10500000,6200000]
["(d)",null,"Principal Payments to Noteholders on Payment Date",275076134.53000003,21349482.670000002,0,0,0,0]
[null,null,"Gross Aggregate Charge-Offs",0,0,0,0,0,0]
[null,null,"Gross Aggregate Reinstatements of charge-offs",0,0,0,0,0,0]
["(e)",null,"Aggregate Charge-Offs for this Collection Period",355647.93,0,0,0,0,0]
["(f)",null,"Reinstatements relating to Charge-offs that have occurred this Collection Period",0,0,0,0,0,0]
[null,null,"Aggregate Carry Over Charge-offs not previously reinstated",84066.21,0,0,0,0,0]
[null,null,"Reinstatements of Carry Over Charge-offs not previously reinstated",0,0,0,0,0,0]
[null,null,"Aggregate Charge-Offs not reinstated and to be carried over to next period",439714.14,0,0,0,0,0]
[null,null,"Invested Amount as at Payment Date:  16 August 2016",253810718.06999999,8810718.0699999928,198000000,11300000,10500000,6200000]
[null,null,"Stated Amount as at Payment Date:  16 August 2016",253371003.93000001,8810718.0699999928,198000000,11300000,10500000,6200000]
[null,null,"Bond Factor at Payment Date:  16 August 2016",null,8.39116006666666E-2,1,1,1,1]
[null,null,"Coupon Margin",null,6.0000000000000001E-3,1.2999999999999999E-2,0.02,2.5000000000000001E-2,2.4500000000000001E-2]
[null,null,"Coupon Rate (3 month BBSW + margin)",null,2.5849999999999998E-2,3.2849999999999997E-2,3.9849999999999997E-2,4.4850000000000001E-2,4.4350000000000001E-2]
[null,null,"Days in Coupon Period",null,92,92,92,92,92]
[null,null,"Coupon Entitlement to be paid out on the current Payment Date: 16 August 2016",null,196512.3,1639440,113501.53,118698.9,69307.509999999995]
[]
[]
[null,null,"TOTAL NOTE BALANCES"]
[null,null,null,"Total Notes","Class A1 Notes","Class A2 Notes","Class B Notes","Class C Notes","Class D Notes"]
[null,null,"Initial Invested Amount",350000000,105000000,198000000,11300000,10500000,6200000]
["(a)",null,"Invested Amount as at Previous Payment Date:  16 August 2016",350000000,8810718.0699999928,198000000,11300000,10500000,6200000]
["(b)",null,"Stated Amount as at Previous Payment Date:  16 August 2016",253810718.06999999,8810718.0699999928,198000000,11300000,10500000,6200000]
["(d)",null,"Principal Payments to Noteholders on Payment Date",253371003.93000001,8810718.0700000003,11575221.07,0,0,0]
[null,null,"Gross Aggregate Charge-Offs",0,0,0,0,0,0]
[null,null,"Gross Aggregate Reinstatements of charge-offs",0,0,0,0,0,0]
["(e)",null,"Aggregate Charge-Offs for this Collection Period",0,0,0,0,0,0]
["(f)",null,"Reinstatements relating to Charge-offs that have occurred this Collection Period",0,0,0,0,0,0]
[null,null,"Aggregate Carry Over Charge-offs not previously reinstated",439714.14,0,0,0,0,0]
[null,null,"Reinstatements of Carry Over Charge-offs not previously reinstated",0,0,0,0,0,0]
[null,null,"Aggregate Charge-Offs not reinstated and to be carried over to next period",439714.14,0,0,0,0,0]
[null,null,"Invested Amount as at Payment Date:  16 November 2016",233424778.93000001,0,186424778.93000001,11300000,10500000,6200000]
[null,null,"Stated Amount as at Payment Date:  16 November 2016",232985064.79000002,-7.4505805969238281E-9,186424778.93000001,11300000,10500000,6200000]
[null,null,"Bond Factor at Payment Date:  16 November 2016",null,-7.0957910446893603E-17,0.94153928752525251,1,1,1]
[null,null,"Coupon Margin",null,6.0000000000000001E-3,1.2999999999999999E-2,0.02,2.5000000000000001E-2,2.4500000000000001E-2]
[null,null,"Coupon Rate (3 month BBSW + margin)",null,2.3550000000000001E-2,3.0550000000000001E-2,3.755E-2,4.2550000000000004E-2,4.2050000000000004E-2]
[null,null,"Days in Coupon Period",null,92,92,92,92,92]
[null,null,"Coupon Entitlement to be paid out on the current Payment Date: 16 November 2016",null,52299.46,1524654.25,106950.63,112611.78,65713.210000000006]

{"sheet":"Cumulative Defaults","index":2,"n_rows":14,"n_cols":4,"rows_kept":14,"cut":false,"hidden":false,"merged":[]}
["Cumulative Defaults & Losses"]
[]
["Month","Gross Losses","Recoveries","Net Losses"]
["2016-04-01",2.4018917142857145E-4,0,{"$f":"B4-C4","v":2.4018917142857145E-4}]
["2016-07-01",1.2563261142857142E-3,-2.4793114285714286E-5,1.2811192285714285E-3]
["2016-10-01",{"$f":"B5+'Collateral Tables'!E9/350000000","v":1.2563261142857142E-3},{"$f":"C5+'Collateral Tables'!E23/350000000","v":2.3424894285714297E-4},1.0220771714285713E-3]
["2017-01-01"]
["2017-04-01"]
["2017-07-01"]
["2017-10-01"]
["2018-01-01"]
["2018-04-01"]
["2018-07-01"]
["2018-10-01"]