{"text_format":"1","workbook":"xlsx","n_sheets":3,"sheets":["Collateral Tables","Note Balances","Cumulative Defaults"],"not_rendered":{"charts":1,"images":0,"macros":1,"external_links":10,"defined_names":24,"comments":2,"pivot_tables":0},"unopened":[],"bounds":{"document_bytes":16777216,"sheet_cells":100000,"rows_first":2000,"rows_last":500,"rows_between":2000,"halvings":0,"cell_chars":16384,"cell_head_chars":4096},"cells_cut":0,"cells_raw":0,"read":"whole","date_system":"1900"}

{"sheet":"Collateral Tables","index":0,"n_rows":248,"n_cols":56,"rows_kept":248,"cut":false,"hidden":false,"merged":[]}
[null,"CNH CAPITAL AUSTRALIA RECEIVABLES TRUST SERIES 2013-1 (TERM DEAL)"]
[null,"COLLATERAL DATA TABLES"]
[]
[null,"OUTSTANDING RECEIVABLES",null,null,"2016-09-30",null,null,null,"2016-06-30",null,null,null,"2016-03-31",null,null,null,"2015-12-31",null,null,null,"2015-09-30",null,null,null,"2015-06-30",null,null,null,"2015-03-31",null,null,null,"2014-12-31",null,null,null,"2014-09-30",null,null,null,null,"2014-06-30",null,null,null,"2014-03-31",null,null,null,"2013-12-31",null,null,null,"2013-09-30"]
[]
[null,"Opening Balance",null,null,{"$f":"I13","v":41989804.84999983},null,null,null,58447655.789999835,null,null,null,95941881.609999835,null,null,null,106929319.49999984,null,null,null,122384966.49999984,null,null,null,146319266.80999985,null,null,null,204214917.49999979,null,null,null,224805731.8299998,null,null,null,244850646.10999984,null,null,null,null,277467453.62999982,null,null,null,343183216.40999991,null,null,null,367572501.20999992,null,null,null,399999996.31]
[null,"Principal Repayments - Scheduled",null,null,{"$f":"MIN([5]Sheet1!$B$3+[6]Sheet1!$B$3+[7]Sheet1!$B$3)","v":4770953.26},null,null,null,16112532.850000001,null,null,null,37479614.460000008,null,null,null,8674137.6599999983,null,null,null,10381883.780000001,null,null,null,22268062.229999997,null,null,null,54555112.799999997,null,null,null,13888436.000000004,null,null,null,14956529.120000012,null,null,null,null,32255502.999999966,null,null,null,62541048.239999987,null,null,null,19784632.49000001,null,null,null,28316894.299999997]
[null,"Principal Repayments - Unscheduled",null,null,{"$f":"'[4]17 Oct 16'!$H$23-'Collateral Tables'!E7","v":1635124.5599999996},null,null,null,192295.48000000417,null,null,null,14611.359999991953,null,null,null,2313300.2300000004,null,null,null,4847899.359999992,null,null,null,1660682.4000000171,null,null,null,3156225.5299999416,null,null,null,6582118.4599999972,null,null,null,4510240.3400000222,null,null,null,null,0,null,null,null,2187328.1800000817,null,null,null,4506158.3999999613,null,null,null,3783540.9800000787]
[{"$f":"SUM($P9:BC9)","v":2888381.1999999997},"Charge-Offs",null,null,{"$f":"'[4]17 Oct 16'!H37","v":65366.880000000005},null,null,null,153022.61000000002,null,null,null,0,null,null,null,0,null,null,null,225863.86000000002,null,null,null,5555.68,null,null,null,184312.36000000002,null,null,null,120259.87,null,null,null,578144.81999999995,null,null,null,null,361304.52,null,null,null,987386.3600000001,null,null,null,98493.91,null,null,null,327059.82]
[null,"Reinstatements"]
[null,"New Receivables Purchased"]
[null,"Non Cash Change in Receivables"]
[null,"Closing Balance",null,null,{"$f":"E6-E7-E8-E9+E10+E11-E12","v":35518360.149999827},null,null,null,41989804.84999983,null,null,null,58447655.789999835,null,null,null,95941881.609999835,null,null,null,106929319.49999984,null,null,null,122384966.49999984,null,null,null,146319266.80999985,null,null,null,204214917.49999979,null,null,null,224805731.8299998,null,null,null,null,244850646.10999984,null,null,null,277467453.62999982,null,null,null,343183216.40999991,null,null,null,367572501.20999992]
[]
[null,"PORTFOLIO STATISTICS"]
[]
[null,"Summary"]
[null,"Number of contracts",null,null,{"$f":"'[8]Servicer Recon'!$B$4","v":1045},null,null,null,1225,null,null,null,1481,null,null,null,2034,null,null,null,2406,null,null,null,2752,null,null,null,3158,null,null,null,3587,null,null,null,3794,null,null,null,null,3987,null,null,null,4163,null,null,null,4387,null,null,null,4617]
[null,"Dollar value of contracts",null,null,{"$f":"'[8]Servicer Recon'!$B$5","v":35518360.149999999},null,null,null,41989804.849999987,null,null,null,58447655.790000007,null,null,null,95941881.609999955,null,null,null,106929319.49999991,null,null,null,122384966.4999999,null,null,null,146319266.81000018,null,null,null,204214917.49999976,null,null,null,224805731.83000013,null,null,null,null,244850646.10999987,null,null,null,277467453.63000029,null,null,null,343183216.41000015,null,null,null,367572501.21000028]
[null,"Number of contracts closed during the Quarter",null,null,{"$f":"'[8]Servicer Recon'!$B$19","v":178},null,null,null,255,null,null,null,553,null,null,null,372,null,null,null,341,null,null,null,405,null,null,null,427,null,null,null,205,null,null,null,185,null,null,null,null,174,null,null,null,221,null,null,null,228,null,null,null,183]
[null,"Dollar value of contracts closed during the Quarter",null,null,{"$f":"'[8]Servicer Recon'!$B$20","v":4201645.5700000012},null,null,null,8505040.8099999968,null,null,null,17464869.680000007,null,null,null,5707145.009999997,null,null,null,8570373.3299999945,null,null,null,8087803.5200000023,null,null,null,15823850.750000006,null,null,null,7686522.0700000031,null,null,null,7266274.0300000031,null,null,null,null,9339916.7400000002,null,null,null,10700990.200000003,null,null,null,9069702.0300000031,null,null,null,8446613.110000005]
[]
[{"$f":"SUM($P23:BB23)","v":1339343.4990909093},"Dollar Value of Recoveries from Collateral",null,null,{"$f":"'[8]Servicer Recon'!$C$16","v":234693.43000000002},null,null,null,77567.039999999994,null,null,null,164875.25545454546,null,null,null,88400,null,null,null,81946.490909090906,null,null,null,131101.07363636364,null,null,null,238237.99999999997,null,null,null,124219.36363636365,null,null,null,488268.8609090909,null,null,null,null,73202.576363636355,null,null,null,19020.849999999999,null,null,null,94500,null,null,null,446.28363636364156]
[null,"Dollar Value of Recoveries from Other Sources",null,null,0,null,null,null,0,null,null,null,0,null,null,null,0,null,null,null,0,null,null,null,0,null,null,null,0,null,null,null,0,null,null,null,0,null,null,null,null,0,null,null,null,0,null,null,null,0,null,null,null,0]
[]
[null,"Average Term of Contracts (Months)",null,null,{"$f":"[9]Sheet1!$W$1049","v":57.379129883337193},null,null,null,57.472891857224376,null,null,null,56.976262035127867,null,null,null,55.508959780343829,null,null,null,55.227644868814536,null,null,null,54.871997450438478,null,null,null,54.412965064665407,null,null,null,53.347779275967987,null,null,null,52.961048448147828,null,null,null,null,52.617445908768794,null,null,null,52.232977773264125,null,null,null,51.719252312429639,null,null,null,51.33729628389451]
[null,"Average Term to Maturity (Months)",null,null,{"$f":"[9]Sheet1!$X$1049","v":9.0556896557624587},null,null,null,11.655211158477195,null,null,null,13.179288905232601,null,null,null,13.942072392507491,null,null,null,16.420918753719398,null,null,null,18.772652585969364,null,null,null,20.936500535147783,null,null,null,22.282256552046459,null,null,null,24.771326100399968,null,null,null,null,27.278972823699711,null,null,null,29.553464471601743,null,null,null,31.625494308828717,null,null,null,33.937634820954983]
[null,"Average Residual / Balloon Payment *",null,null,{"$f":"[9]Sheet1!$AI$1049","v":3.5423607801906495E-2},null,null,null,3.9210093376567896E-2,null,null,null,3.7140360471839766E-2,null,null,null,2.8329340025589549E-2,null,null,null,2.9880997807015412E-2,null,null,null,3.1894877383126671E-2,null,null,null,3.0343988165784E-2,null,null,null,2.6717759216515216E-2,null,null,null,2.7684443982298818E-2,null,null,null,null,2.8252070744069012E-2,null,null,null,2.9672797460436096E-2,null,null,null,2.8756254370488909E-2,null,null,null,3.0683073715412873E-2]
[null,"Average Seasoning (Months)",null,null,{"$f":"E26-E27","v":48.323440227574736},null,null,null,45.817680698747182,null,null,null,43.796973129895264,null,null,null,41.566887387836339,null,null,null,38.806726115095138,null,null,null,36.099344864469117,null,null,null,33.476464529517628,null,null,null,31.065522723921529,null,null,null,28.18972234774786,null,null,null,null,25.338473085069083,null,null,null,22.679513301662382,null,null,null,20.093758003600922,null,null,null,17.399661462939527]
[null,"Average Dollar Value of Individual Assets",null,null,{"$f":"E19/E18","v":33988.861387559809},null,null,null,34277.391714285703,null,null,null,39464.993781228906,null,null,null,47169.066671583067,null,null,null,44442.776184538619,null,null,null,44471.281431686009,null,null,null,46332.890060164718,null,null,null,56931.953582380753,null,null,null,59252.960419082796,null,null,null,null,61412.251344369164,null,null,null,66650.841611818469,null,null,null,78227.311695919794,null,null,null,79612.844100065035]
[null,"Weighted Average Interest Rate",null,null,{"$f":"[9]Sheet1!$AA$1049/100","v":5.3177710759378577E-2},null,null,null,5.5005748305812167E-2,null,null,null,5.5037268234002415E-2,null,null,null,5.5450178703203207E-2,null,null,null,5.6277268052263726E-2,null,null,null,5.6863873807054113E-2,null,null,null,5.6378739753992012E-2,null,null,null,5.6431842454331041E-2,null,null,null,5.6530291626535362E-2,null,null,null,null,5.6711593429855517E-2,null,null,null,5.649380812347129,null,null,null,5.6768052315365471,null,null,null,5.7023006689852697E-2]
[]
[null,"Payment in Arrears"]
["1. 0 - 30 Days","0 - 30 Days",null,null,{"$f":"IFERROR(VLOOKUP(A34,[10]arrear!$A$2:$D$7,3,FALSE),0)","v":1034},{"$f":"IFERROR(VLOOKUP(A34,[10]arrear!$A$2:$D$7,2,FALSE),0)","v":99854.53},{"$f":"F34/F$50","v":2.8113496675605957E-3},null,1210,11209.500000000044,2.6695765888990668E-4,null,1468,765890.26,1.3103866179882592E-2,null,2026,106529.86000000002,1.1103582524370304E-3,null,2393,35056.799999999974,3.2785021137256932E-4,null,2731,190095.86999999997,1.5532616091372641E-3,null,3144,440570.21,3.0110198035101779E-3,null,3571,165791.63,{"$f":"AH34/AH$50","v":8.118487720173539E-4},null,3773,137016.97999999998,6.0949059832519437E-4,null,null,3958,196150.03999999998,8.0110076536975565E-4,null,4144,1000907.0400000002,3.6072952950175503E-3,null,4375,439735.71,1.2813438681530656E-3,null,4592,151245.59999999998,4.1147147706131298E-4]
["2. 31 - 60 Days","31 - 60 Days",null,null,{"$f":"IFERROR(VLOOKUP(A35,[10]arrear!$A$2:$D$7,3,FALSE),0)","v":5},{"$f":"IFERROR(VLOOKUP(A35,[10]arrear!$A$2:$D$7,2,FALSE),0)","v":57450.8},{"$f":"F35/F$50","v":1.6174958460181052E-3},null,3,53747.09,1.2800033291890858E-3,null,10,224977.20999999996,3.8492084405974077E-3,null,3,26059.349999999911,2.7161599879737782E-4,null,6,26093.110000000011,2.4402203363877229E-4,null,8,43163.760000000009,3.5268841618713075E-4,null,11,188256.10000000003,1.2866118324967829E-3,null,11,73352.88999999997,{"$f":"AH35/AH$50","v":3.5919457255124412E-4},null,12,119136.47,5.2995299110118743E-4,null,null,13,256735.05,1.0485373597285143E-3,null,14,244533.99000000008,8.8130693096021072E-4,null,7,47270.050000000017,1.3773998185134619E-4,null,12,113514.01999999996,3.0882076223419006E-4]
["3. 61 - 90 Days","61 - 90 Days",null,null,{"$f":"IFERROR(VLOOKUP(A36,[10]arrear!$A$2:$D$7,3,FALSE),0)","v":1},{"$f":"IFERROR(VLOOKUP(A36,[10]arrear!$A$2:$D$7,2,FALSE),0)","v":4987.03},1.4040710153675266E-4,null,5,66469.030000000057,1.5829802076348562E-3,null,0,0,0,null,1,11130.79,1.1601596521992588E-4,null,3,38096.559999999983,3.5627796172405278E-4,null,6,29444.069999999985,2.4058567683637853E-4,null,1,6072.16,4.1499387827611765E-5,null,2,4505.4000000000005,2.2062051368015303E-5,null,2,30127.02,1.3401357587618045E-4,null,null,4,84804.989999999991,3.4635395637020756E-4,null,3,32291.389999999992,1.163790187913722E-4,null,5,79546.5,2.3179018144338975E-4,null,6,75092.269999999975,2.0429240422721002E-4]
["4. 91 - 120 Days","91 - 120 Days",null,null,{"$f":"IFERROR(VLOOKUP(A37,[10]arrear!$A$2:$D$7,3,FALSE),0)","v":1},{"$f":"IFERROR(VLOOKUP(A37,[10]arrear!$A$2:$D$7,2,FALSE),0)","v":27154.62},7.6452347139117569E-4,null,6,89137.68,2.1228410162520686E-3,null,2,114659.96999999986,1.9617548120658313E-3,null,1,3471.3099999999995,3.6181383372391427E-5,null,1,26482.620000000003,2.4766472024541429E-4,null,5,91393.239999999991,7.4676851752049204E-4,null,1,1157.3599999999999,7.909826403810958E-6,null,2,24211.510000000002,1.1855896864145607E-4,null,6,43506.95,1.9353131989045675E-4,null,null,7,114330.86,4.6694122239986487E-4,null,1,8490.2099999999991,3.0598940124060822E-5,null,0,0,0,null,4,69228.5,1.8833971467427225E-4]
["5. 121 - 150 Days","121 - 150 Days",null,null,{"$f":"IFERROR(VLOOKUP(A38,[10]arrear!$A$2:$D$7,3,FALSE),0)","v":1},{"$f":"IFERROR(VLOOKUP(A38,[10]arrear!$A$2:$D$7,2,FALSE),0)","v":6616.85},1.8629379205728901E-4,null,1,27158.790000000015,6.4679486120545831E-4,null,0,0,0,null,1,8146.559999999994,8.4911405355957541E-5,null,2,22928.680000000008,2.1442837294031431E-4,null,2,24056.860000000004,1.9656711676266242E-4,null,1,11015.58,7.5284548919343959E-5,null,1,4457.7299999999996,2.182862082051379E-5,null,1,28318.99,1.2597094286463764E-4,null,null,4,55109.56,2.2507418655224579E-4,null,0,0,0,null,0,0,0,null,3,96751.01999999999,2.6321615376968745E-4]
["6. 151 - 180 Days","151 - 180 Days",null,null,{"$f":"IFERROR(VLOOKUP(A39,[10]arrear!$A$2:$D$7,3,FALSE),0)","v":3},{"$f":"IFERROR(VLOOKUP(A39,[10]arrear!$A$2:$D$7,2,FALSE),0)","v":48946.26},1.3780551746559167E-3,null,0,0,0,null,1,6680.7900000000027,1.1430381440795167E-4,null,2,31329.639999999985,3.2654810885775372E-4,null,1,1501.2699999999968,1.4039834977159822E-5,null,0,0,0,null,0,0,0,null,0,0,0,null,0,0,0,null,null,1,12986.28,5.3037556593442201E-5,null,1,35526.209999999977,1.2803739514391402E-4,null,0,0,0,null,0,0,0]
[null,"Total",null,null,{"$f":"SUM(E34:E39)","v":1045},{"$f":"SUM(F34:F39)","v":245010.09000000003},{"$f":"SUM(G34:G39)","v":6.8981250532198354E-3},null,1225,247722.09000000011,5.8995770731713757E-3,null,1481,1112208.23,1.9029133246953781E-2,null,2034,186667.50999999992,1.9456311140404366E-3,null,2406,150159.03999999995,1.404283134898283E-3,null,2752,378153.79999999993,3.0898713364439279E-3,null,3158,647071.41,4.4223253991577272E-3,null,{"$f":"SUM(AG34:AG39)","v":3587},{"$f":"SUM(AH34:AH39)","v":272319.15999999992},{"$f":"SUM(AI34:AI39)","v":1.3334929853985832E-3},null,3794,358106.41,1.5929594280576567E-3,null,null,3987,720116.78,2.9410450470140305E-3,null,4163,1321748.8400000001,4.7636175800371081E-3,null,4387,566552.26,1.6508740314478015E-3,null,4617,505831.40999999992,1.3761405119666727E-3]
{"$rows_left_out":209}
{"sheet":"Note Balances","index":1,"n_rows":269,"n_cols":8,"rows_kept":269,"cut":false,"hidden":false,"merged":[]}
[null,null,"TOTAL NOTE BALANCES"]
[null,null,null,"Total Notes","Class A1 Notes","Class A2 Notes","Class B Notes","Class C Notes"]
[null,null,"Initial Invested Amount",400000000,100000000,244800000,13600000,12000000]
["(a)",null,"Invested Amount as at Previous Payment Date:  16 October 2013",367899561.02999997,67899561.030000001,244800000,13600000,12000000]
["(b)",null,"Stated Amount as at Previous Payment Date:  16 October 2013",367572501.20999998,67899561.030000001,244800000,13600000,12000000]
["(d)",null,"Principal Payments to Noteholders on Payment Date",24290790.890000001,24290790.890000001,0,0,0]
[null,null,"Gross Aggregate Charge-Offs",0,0,0,0,0]
[null,null,"Gross Aggregate Reinstatements of charge-offs",0,0,0,0,0]
["(e)",null,"Aggregate Charge-Offs for this Collection Period",98493.91,0,0,0,0]
["(f)",null,"Reinstatements relating to Charge-offs that have occurred this Collection Period",0,0,0,0,0]
[null,null,"Aggregate Carry Over Charge-offs not previously reinstated",0,0,0,0,0]
[null,null,"Reinstatements of Carry Over Charge-offs not previously reinstated",0,0,0,0,0]
[null,null,"Aggregate Charge-Offs not reinstated and to be carried over to next period",98493.91,0,0,0,0]
[null,null,"Invested Amount as at Payment Date:  16 January 2014",343608770.13999999,43608770.140000001,244800000,13600000,12000000]
[null,null,"Stated Amount as at Payment Date:  16 January 2014",343183216.40999997,43608770.140000001,244800000,13600000,12000000]
[null,null,"Bond Factor at Payment Date:  16 January 2014",null,0.43608770140000003,1,1,1]
[null,null,"Coupon Margin",null,4.4999999999999997E-3,1.0999999999999999E-2,1.7500000000000002E-2,2.5000000000000001E-2]
[null,null,"Coupon Rate (3 month BBSW + margin)",null,3.0450000000000001E-2,3.6949999999999997E-2,4.3450000000000003E-2,5.0950000000000002E-2]
[null,null,"Days in Coupon Period",null,92,92,92,92]
[null,null,"Coupon Entitlement to be paid out on the current Payment Date: 16 January 2014",null,521133.78,2279926.36,148944.22,154106.29999999999]
[]
[]
[null,null,"TOTAL NOTE BALANCES"]
[null,null,null,"Total Notes","Class A1 Notes","Class A2 Notes","Class B Notes","Class C Notes"]
[null,null,"Initial Invested Amount",400000000,100000000,244800000,13600000,12000000]
["(a)",null,"Invested Amount as at Previous Payment Date:  16 January 2014",343608770.13999999,43608770.140000001,244800000,13600000,12000000]
["(b)",null,"Stated Amount as at Previous Payment Date:  16 January 2014",343183216.40999997,43608770.140000001,244800000,13600000,12000000]
["(d)",null,"Principal Payments to Noteholders on Payment Date",64728376.420000002,43608770.140000001,21119606.280000001,0,0]
[null,null,"Gross Aggregate Charge-Offs",425553.73,0,0,0,0]
[null,null,"Gross Aggregate Reinstatements of charge-offs",0,0,0,0,0]
["(e)",null,"Aggregate Charge-Offs for this Collection Period",987386.3600000001,0,0,0,0]
["(f)",null,"Reinstatements relating to Charge-offs that have occurred this Collection Period",0,0,0,0,0]
[null,null,"Aggregate Carry Over Charge-offs not previously reinstated",425553.73,0,0,0,0]
[null,null,"Reinstatements of Carry Over Charge-offs not previously reinstated",0,0,0,0,0]
[null,null,"Aggregate Charge-Offs not reinstated and to be carried over to next period",1412940.09,0,0,0,0]
[null,null,"Invested Amount as at Payment Date:  16 April 2014",278880393.72000003,0,223680393.72,13600000,12000000]
[null,null,"Stated Amount as at Payment Date:  16 April 2014",277467453.63,0,223680393.72,13600000,12000000]
[null,null,"Bond Factor at Payment Date:  16 April 2014",null,0,0.91372709852941181,1,1]
[null,null,"Coupon Margin",null,4.4999999999999997E-3,1.0999999999999999E-2,1.7500000000000002E-2,2.5000000000000001E-2]
[null,null,"Coupon Rate (3 month BBSW + margin)",null,3.075E-2,3.7249999999999998E-2,4.3749999999999997E-2,5.1250000000000004E-2]
{"$rows_left_out":230}
{"sheet":"Cumulative Defaults","index":2,"n_rows":16,"n_cols":4,"rows_kept":16,"cut":false,"hidden":false,"merged":[]}
["Cumulative Defaults & Losses"]
[]
["Month","Gross Losses","Recoveries","Net Losses"]
["2013-09-01",8.1764955000000002E-4,1.1157090909091038E-6,{"$f":"B4-C4","v":8.1653384090909088E-4}]
["2013-12-01",1.063884325E-3,2.3736570909090911E-4,8.2651861590909092E-4]
["2014-03-01",3.5323502250000005E-3,2.8491783409090912E-4,3.2474323909090913E-3]
["2014-06-01",4.4356115250000008E-3,4.6792427499999997E-4,3.9676872500000009E-3]
["2014-09-01",5.880973575000001E-3,1.6885964272727273E-3,4.1923771477272737E-3]
["2014-12-01",6.1816232500000014E-3,1.9991448363636363E-3,4.1824784136363646E-3]
["2015-03-01",6.6424041500000013E-3,2.3268975204545454E-3,4.3155066295454559E-3]
["2015-06-01",6.656293350000001E-3,2.6546502045454545E-3,4.0016431454545469E-3]
["2015-09-01",7.2209530000000013E-3,2.8595164318181818E-3,4.3614365681818191E-3]
["2015-12-01",7.2209530000000013E-3,3.0805164318181816E-3,4.1404365681818201E-3]
["2016-03-01",7.2209530000000013E-3,3.4927045704545453E-3,3.728248429545456E-3]
["2016-06-01",7.6035095250000014E-3,3.6866221704545451E-3,3.9168873545454563E-3]
["2016-09-01",{"$f":"B15+'Collateral Tables'!E9/400000000","v":7.7669267250000014E-3},{"$f":"C15+'Collateral Tables'!E23/400000000","v":4.2733557454545448E-3},{"$f":"B16-C16","v":3.4935709795454566E-3}]