{"text_format":"1","workbook":"xlsx","n_sheets":3,"sheets":["Collateral Tables","Note Balance","Cumulative Defaults"],"not_rendered":{"charts":1,"images":0,"macros":1,"external_links":8,"defined_names":24,"comments":1,"pivot_tables":0},"unopened":[],"bounds":{"document_bytes":16777216,"sheet_cells":100000,"rows_first":2000,"rows_last":500,"rows_between":2000,"halvings":0,"cell_chars":16384,"cell_head_chars":4096},"cells_cut":0,"cells_raw":0,"read":"whole","date_system":"1900"}

{"sheet":"Collateral Tables","index":0,"n_rows":247,"n_cols":7,"rows_kept":247,"cut":false,"hidden":false,"merged":[]}
[null,"CNH CAPITAL AUSTRALIA RECEIVABLES TRUST SERIES 2016-1 (TERM DEAL)"]
[null,"COLLATERAL DATA TABLES"]
[]
[null,"OUTSTANDING RECEIVABLES",null,null,"2016-04-30"]
[]
[null,"Opening Balance",null,null,349999833.42000002]
[null,"Principal Repayments - Scheduled",null,null,{"$f":"MIN('[1]16 May 16'!$H23,SUM([2]Sheet1!$B$3:$B$6))","v":70539694.680000007}]
[null,"Principal Repayments - Unscheduled",null,null,{"$f":"MAX('[1]16 May 16'!H23-'Collateral Tables'!E7,0)","v":4299937.9999999255}]
[{"$f":"SUM(E9)","v":84066.21},"Charge-Offs",null,null,{"$f":"'[1]16 May 16'!$H37","v":84066.21}]
[null,"Reinstatements"]
[null,"New Receivables Purchased"]
[null,"Non Cash Change in Receivables"]
[null,"Closing Balance",null,null,{"$f":"E6-E7-E8-E9+E10+E11-E12","v":275076134.53000009}]
[]
[null,"PORTFOLIO STATISTICS"]
[]
[null,"Summary"]
[null,"Number of contracts",null,null,{"$f":"[3]Summary!$B$4","v":3422}]
[null,"Dollar value of contracts",null,null,{"$f":"[3]Summary!$B$6","v":80384.609739918029}]
[null,"Number of contracts closed during the Quarter",null,null,{"$f":"[3]Summary!$B$19","v":216}]
[null,"Dollar value of contracts closed during the Quarter",null,null,{"$f":"[3]Summary!$B$20","v":10129289.880000003}]
[]
[{"$f":"SUM(E23)","v":0},"Dollar Value of Recoveries from Collateral",null,null,{"$f":"[3]Summary!$C$16","v":0}]
[null,"Dollar Value of Recoveries from Other Sources",null,null,0]
[]
[null,"Average Term of Contracts (Months)",null,null,{"$f":"[4]Sheet1!$W$3424","v":50.602561692977268}]
[null,"Average Term to Maturity (Months)",null,null,{"$f":"[4]Sheet1!$X$3424","v":33.580143025830573}]
[null,"Average Residual / Balloon Payment *",null,null,{"$f":"[4]Sheet1!$AI$3424","v":2.4040809082651878E-2}]
[null,"Average Seasoning (Months)",null,null,{"$f":"E26-E27","v":17.022418667146695}]
[null,"Average Dollar Value of Individual Assets",null,null,{"$f":"E19/E18","v":23.490534698982476}]
[null,"Weighted Average Interest Rate",null,null,{"$f":"[4]Sheet1!$AA$3424/100","v":3.6655471442132145E-2}]
[]
[null,"Payment in Arrears"]
["1. 0 - 30 Days","0 - 30 Days",null,null,{"$f":"IFERROR(VLOOKUP($A34,'[5]Arrears Reporting'!$A:$D,3,FALSE),0)","v":3409},{"$f":"IFERROR(VLOOKUP($A34,'[5]Arrears Reporting'!$A:$D,2,FALSE),0)","v":279917.05},{"$f":"F34/F$50","v":1.0175984567991395E-3}]
["2. 31 - 60 Days","31 - 60 Days",null,null,{"$f":"IFERROR(VLOOKUP($A35,'[5]Arrears Reporting'!$A:$D,3,FALSE),0)","v":8},{"$f":"IFERROR(VLOOKUP($A35,'[5]Arrears Reporting'!$A:$D,2,FALSE),0)","v":230113.48},{"$f":"F35/F$50","v":8.3654469113860581E-4}]
["3. 61 - 90 Days","61 - 90 Days",null,null,{"$f":"IFERROR(VLOOKUP($A36,'[5]Arrears Reporting'!$A:$D,3,FALSE),0)","v":3},{"$f":"IFERROR(VLOOKUP($A36,'[5]Arrears Reporting'!$A:$D,2,FALSE),0)","v":35237.550000000097},1.2810108030712178E-4]
["4. 91 - 120 Days","91 - 120 Days",null,null,{"$f":"IFERROR(VLOOKUP($A37,'[5]Arrears Reporting'!$A:$D,3,FALSE),0)","v":1},{"$f":"IFERROR(VLOOKUP($A37,'[5]Arrears Reporting'!$A:$D,2,FALSE),0)","v":48099.140000000007},1.7485755382662749E-4]
["5. 121 - 150 Days","121 - 150 Days",null,null,{"$f":"IFERROR(VLOOKUP($A38,'[5]Arrears Reporting'!$A:$D,3,FALSE),0)","v":1},{"$f":"IFERROR(VLOOKUP($A38,'[5]Arrears Reporting'!$A:$D,2,FALSE),0)","v":30045.720000000012},1.09226923852688E-4]
["6. 151 - 180 Days","151 - 180 Days",null,null,{"$f":"IFERROR(VLOOKUP($A39,'[5]Arrears Reporting'!$A:$D,3,FALSE),0)","v":0},{"$f":"IFERROR(VLOOKUP($A39,'[5]Arrears Reporting'!$A:$D,2,FALSE),0)","v":0},0]
[null,"Total",null,null,{"$f":"SUM(E34:E39)","v":3422},{"$f":"SUM(F34:F39)","v":623412.94000000006},{"$f":"SUM(G34:G39)","v":2.2663287059241826E-3}]
[null,"* Expressed as a % of Aggreg. Rec. closing bal.",null,null,null,"> 30 days",{"$f":"SUM(G35:G39)","v":1.2487302491250431E-3}]
[]
[" 0 - 30 Days","Account Balances in Arrears"]
["1. 0 - 30 Days","0 - 30 Days",null,null,{"$f":"IFERROR(VLOOKUP($A44,'[5]Arrears Reporting'!$A:$D,3,FALSE),0)","v":3409},{"$f":"IFERROR(VLOOKUP($A44,'[5]Arrears Reporting'!$A:$D,4,FALSE),0)","v":273901148.7699995},{"$f":"F44/F$50","v":0.99572850708402028}]
["2. 31 - 60 Days","31 - 60 Days",null,null,{"$f":"IFERROR(VLOOKUP($A45,'[5]Arrears Reporting'!$A:$D,3,FALSE),0)","v":8},{"$f":"IFERROR(VLOOKUP($A45,'[5]Arrears Reporting'!$A:$D,4,FALSE),0)","v":698753.64},{"$f":"F45/F$50","v":2.5402190604208695E-3}]
["3. 61 - 90 Days","61 - 90 Days",null,null,{"$f":"IFERROR(VLOOKUP($A46,'[5]Arrears Reporting'!$A:$D,3,FALSE),0)","v":3},{"$f":"IFERROR(VLOOKUP($A46,'[5]Arrears Reporting'!$A:$D,4,FALSE),0)","v":107754.56},3.9172631309550559E-4]
["4. 91 - 120 Days","91 - 120 Days",null,null,{"$f":"IFERROR(VLOOKUP($A47,'[5]Arrears Reporting'!$A:$D,3,FALSE),0)","v":1},{"$f":"IFERROR(VLOOKUP($A47,'[5]Arrears Reporting'!$A:$D,4,FALSE),0)","v":84424.18},3.0691204871061899E-4]
["5. 121 - 150 Days","121 - 150 Days",null,null,{"$f":"IFERROR(VLOOKUP($A48,'[5]Arrears Reporting'!$A:$D,3,FALSE),0)","v":1},{"$f":"IFERROR(VLOOKUP($A48,'[5]Arrears Reporting'!$A:$D,4,FALSE),0)","v":284053.38},1.0326354937528085E-3]
["6. 151 - 180 Days","151 - 180 Days",null,null,{"$f":"IFERROR(VLOOKUP($A49,'[5]Arrears Reporting'!$A:$D,3,FALSE),0)","v":0},{"$f":"IFERROR(VLOOKUP($A49,'[5]Arrears Reporting'!$A:$D,4,FALSE),0)","v":0},0]
[null,"Total",null,null,{"$f":"SUM(E44:E49)","v":3422},{"$f":"SUM(F44:F49)","v":275076134.52999949},{"$f":"SUM(G44:G49)","v":1}]
["NSW",null,null,null,null,"> 30 days",{"$f":"SUM(G45:G49)","v":4.2714929159798024E-3}]
[null,null,null,null,null,">90 days",{"$f":"SUM(G47:G49)","v":1.3395475424634274E-3}]
[]
["VIC","Geographic Distribution"]
["NSW","New South Wales",null,null,{"$f":"F55/F$63","v":{"$error":"#DIV/0!"}},{"$f":"IFERROR(VLOOKUP(A55,'[5]Geographic '!$A:$C,3,FALSE),0)","v":0}]
["VIC","Victoria",null,null,{"$error":"#DIV/0!"},{"$f":"IFERROR(VLOOKUP(A56,'[5]Geographic '!$A:$C,3,FALSE),0)","v":0}]
["QLD","Queensland",null,null,{"$error":"#DIV/0!"},{"$f":"IFERROR(VLOOKUP(A57,'[5]Geographic '!$A:$C,3,FALSE),0)","v":0}]
["SA","South Australia",null,null,{"$error":"#DIV/0!"},{"$f":"IFERROR(VLOOKUP(A58,'[5]Geographic '!$A:$C,3,FALSE),0)","v":0}]
["NT","Northern Territory",null,null,{"$error":"#DIV/0!"},{"$f":"IFERROR(VLOOKUP(A59,'[5]Geographic '!$A:$C,3,FALSE),0)","v":0}]
["ACT","Australian Capital Territory",null,null,{"$error":"#DIV/0!"},{"$f":"IFERROR(VLOOKUP(A60,'[5]Geographic '!$A:$C,3,FALSE),0)","v":0}]
["TAS","Tasmania",null,null,{"$error":"#DIV/0!"},{"$f":"IFERROR(VLOOKUP(A61,'[5]Geographic '!$A:$C,3,FALSE),0)","v":0}]
["WA","Western Australia",null,null,{"$error":"#DIV/0!"},{"$f":"IFERROR(VLOOKUP(A62,'[5]Geographic '!$A:$C,3,FALSE),0)","v":0}]
[null,"Total",null,null,{"$f":"SUM(E55:E62)","v":{"$error":"#DIV/0!"}},{"$f":"SUM(F55:F62)","v":0}]
["AG",null,null,null,null,null,{"$f":"E13-F63","v":275076134.53000009}]
["CE","Top Industry Distribution"]
["AGRICULTURAL MACHINERY","Agricultural",null,null,{"$f":"F66/F$69","v":0.9852200432911179},{"$f":"IFERROR(VLOOKUP(A66,'[5]Top Industry'!$A:$C,3,FALSE),)","v":271010521.1699996}]
["CONSTRUCTION EQUIPMENT","Construction",null,null,{"$f":"F67/F$69","v":1.4779956708882014E-2},{"$f":"IFERROR(VLOOKUP(A67,'[5]Top Industry'!$A:$C,3,FALSE),)","v":4065613.3599999994}]
["MOTOR VEHICLE - AG","Motor Vehicle AG",null,null,{"$f":"F68/F$69","v":0},{"$f":"IFERROR(VLOOKUP(A68,'[5]Top Industry'!$A:$C,3,FALSE),)","v":0}]
[null,"Total",null,null,{"$f":"SUM(E66:E68)","v":0.99999999999999989},{"$f":"SUM(F66:F68)","v":275076134.52999961},{"$f":"F63-F69","v":-275076134.52999961}]
["COMBINE"]
["40-100 HP TRACTOR","Collateral Types"]
["100<140 HP TRACTOR","100-140 HP TRACTOR",null,null,{"$f":"IFERROR(F72/F$107,0)","v":0.10702894513296701},{"$f":"IFERROR(VLOOKUP(A72,[5]Collateral!$A:$C,3,FALSE),\"\")","v":29441108.51000002}]
["4 EWD Tractors","4 EWD Tractors",null,null,0.10816969673083333,{"$f":"IFERROR(VLOOKUP(A73,[5]Collateral!$A:$C,3,FALSE),\"\")","v":29754902.050000008}]
["40<100 HP Tractor","40<100 HP Tractor",null,null,{"$f":"IFERROR(F74/F$107,0)","v":0},{"$f":"IFERROR(VLOOKUP(A74,[5]Collateral!$A:$C,3,FALSE),\"\")","v":""}]
["40<60 HP TRACTOR","40-60 HP TRACTOR",null,null,{"$f":"IFERROR(F75/F$107,0)","v":8.2621937518615757E-3},{"$f":"IFERROR(VLOOKUP(A75,[5]Collateral!$A:$C,3,FALSE),\"\")","v":2272732.3199999998}]
["4WD VEHICLE","4WD VEHICLE",null,null,8.1090059078052425E-5,{"$f":"IFERROR(VLOOKUP(A76,[5]Collateral!$A:$C,3,FALSE),\"\")","v":22305.939999999995}]
["60<100 HP TRACTOR","60-100 HP TRACTOR",null,null,6.7368036277167365E-2,{"$f":"IFERROR(VLOOKUP(A77,[5]Collateral!$A:$C,3,FALSE),\"\")","v":18531339.010000009}]
["Backhoes","Backhoes",null,null,5.5525191329654385E-4,{"$f":"IFERROR(VLOOKUP(A78,[5]Collateral!$A:$C,3,FALSE),\"\")","v":152736.54999999999}]
["BALERS, WINDROWERS, MOWERS, RAKES","BALERS, WINDROWERS, MOWERS, RAKES",null,null,3.8551025293848094E-2,{"$f":"IFERROR(VLOOKUP(A79,[5]Collateral!$A:$C,3,FALSE),\"\")","v":10604467.01999999}]
["QUAD BIKES","QUAD BIKES",null,null,3.3626544941110479E-5,{"$f":"IFERROR(VLOOKUP(A80,[5]Collateral!$A:$C,3,FALSE),\"\")","v":9249.8599999999951}]
["Combines","Combines",null,null,0.34717658732253526,{"$f":"IFERROR(VLOOKUP(A81,[5]Collateral!$A:$C,3,FALSE),\"\")","v":95499993.639999986}]
["TRUCK - on Farm","TRUCK - on Farm",null,null,7.0909568484839601E-5,{"$f":"IFERROR(VLOOKUP(A82,[5]Collateral!$A:$C,3,FALSE),\"\")","v":19505.529999999984}]
["Cotton Pickers","Cotton Pickers",null,null,1.9809959192972816E-4,{"$f":"IFERROR(VLOOKUP(A83,[5]Collateral!$A:$C,3,FALSE),\"\")","v":54492.47}]
["CRAWLERS / DOZERS","CRAWLERS / DOZERS",null,null,0,{"$f":"IFERROR(VLOOKUP(A84,[5]Collateral!$A:$C,3,FALSE),\"\")","v":""}]
["CULTIVATORS,SEEDERS, HARROWS","CULTIVATORS,SEEDERS, HARROWS",null,null,1.4343276441416268E-2,{"$f":"IFERROR(VLOOKUP(A85,[5]Collateral!$A:$C,3,FALSE),\"\")","v":3945493.0400000005}]
["Drill","Drill",null,null,6.3340747570741303E-4,{"$f":"IFERROR(VLOOKUP(A86,[5]Collateral!$A:$C,3,FALSE),\"\")","v":174235.28000000003}]
["DUMP TRUCKS","DUMP TRUCKS",null,null,0,{"$f":"IFERROR(VLOOKUP(A87,[5]Collateral!$A:$C,3,FALSE),\"\")","v":""}]
["EXCAVATORS / GRADERS","EXCAVATORS / GRADERS",null,null,5.0805466726070482E-3,{"$f":"IFERROR(VLOOKUP(A88,[5]Collateral!$A:$C,3,FALSE),\"\")","v":1397537.1400000001}]
["FEEDERS, MIXERS, WAGONS, BINS, FEED STORAGE","FEEDERS, MIXERS, WAGONS, BINS, FEED STORAGE",null,null,2.7273481259355841E-3,{"$f":"IFERROR(VLOOKUP(A89,[5]Collateral!$A:$C,3,FALSE),\"\")","v":750228.38}]
["Front End Loader","Front End Loader",null,null,5.463704448835379E-4,{"$f":"IFERROR(VLOOKUP(A90,[5]Collateral!$A:$C,3,FALSE),\"\")","v":150293.47}]
["Fronts","Fronts",null,null,3.9743435099084167E-3,{"$f":"IFERROR(VLOOKUP(A91,[5]Collateral!$A:$C,3,FALSE),\"\")","v":1093247.0499999998}]
["GUIDANCE SYSTEMS","Guidance Systems",null,null,0,{"$f":"IFERROR(VLOOKUP(A92,[5]Collateral!$A:$C,3,FALSE),\"\")","v":""}]
["HARVESTERS - Other","HARVESTERS - Other",null,null,2.8119371799433289E-3,{"$f":"IFERROR(VLOOKUP(A93,[5]Collateral!$A:$C,3,FALSE),\"\")","v":773496.80999999994}]
["Irrigation Equipment","Irrigation Equipment",null,null,8.339172003850537E-4,{"$f":"IFERROR(VLOOKUP(A94,[5]Collateral!$A:$C,3,FALSE),\"\")","v":229390.71999999997}]
["Other AG","Other AG",null,null,5.6825801797411929E-3,{"$f":"IFERROR(VLOOKUP(A95,[5]Collateral!$A:$C,3,FALSE),\"\")","v":1563142.1899999997}]
["MATERIALS HANDLING EQUIPMENT","MATERIALS HANDLING EQUIPMENT",null,null,2.5077831676625022E-4,{"$f":"IFERROR(VLOOKUP(A96,[5]Collateral!$A:$C,3,FALSE),\"\")","v":68983.12999999999}]
["Other CE","Other CE",null,null,9.7246597003792796E-4,{"$f":"IFERROR(VLOOKUP(A97,[5]Collateral!$A:$C,3,FALSE),\"\")","v":267502.18}]
["Over 100 HP Tractor","Over 100 HP Tractor",null,null,0,{"$f":"IFERROR(VLOOKUP(A98,[5]Collateral!$A:$C,3,FALSE),\"\")","v":""}]
["OVER 140 HP TRACTOR","OVER 140 HP TRACTOR",null,null,0.21130998019626707,{"$f":"IFERROR(VLOOKUP(A99,[5]Collateral!$A:$C,3,FALSE),\"\")","v":58126332.539999992}]
["Rollers","Rollers",null,null,0,{"$f":"IFERROR(VLOOKUP(A100,[5]Collateral!$A:$C,3,FALSE),\"\")","v":""}]
["SCRAPERS","SCRAPERS",null,null,2.7464425486813972E-4,{"$f":"IFERROR(VLOOKUP(A101,[5]Collateral!$A:$C,3,FALSE),\"\")","v":75548.08}]
["SKIDSTEER / UNILOADER","SKIDSTEER / UNILOADER",null,null,7.2801913311079866E-3,{"$f":"IFERROR(VLOOKUP(A102,[5]Collateral!$A:$C,3,FALSE),\"\")","v":2002606.8900000001}]
["SPRAYING EQUIPMENT","SPRAYING EQUIPMENT",null,null,6.2545564119535171E-2,{"$f":"IFERROR(VLOOKUP(A103,[5]Collateral!$A:$C,3,FALSE),\"\")","v":17204792.009999998}]
["Trenchers","Trenchers",null,null,0,{"$f":"IFERROR(VLOOKUP(A104,[5]Collateral!$A:$C,3,FALSE),\"\")","v":""}]
["Under 40 HP Tractors","Under 40 HP Tractors",null,null,2.8711081437487146E-3,{"$f":"IFERROR(VLOOKUP(A105,[5]Collateral!$A:$C,3,FALSE),\"\")","v":789773.33}]
["Wheel Loaders","Wheel Loaders",null,null,3.660782501981017E-4,{"$f":"IFERROR(VLOOKUP(A106,[5]Collateral!$A:$C,3,FALSE),\"\")","v":100699.39000000001}]
[null,"Total",null,null,{"$f":"SUM(E72:E106)","v":1.0000000000000002},{"$f":"SUM(F72:F106)","v":275076134.52999997},{"$f":"F69-F107","v":0}]
["$ 0 - $25,000"]
["$ 25,001 to $50,000","Contract Balance Distribution"]
["$0 - $25,000","$ 0 - $25,000",null,null,{"$f":"IFERROR(F110/F$121,0)","v":4.9003300642680409E-2},{"$f":"IFERROR(VLOOKUP(A110,'[5] Balance Distribution'!$A:$C,3,FALSE),\"\")","v":13479638.519999996}]
["$25,001 - $50,000","$ 25,001 to $50,000",null,null,{"$f":"IFERROR(F111/F$121,0)","v":9.9211197244098534E-2},{"$f":"IFERROR(VLOOKUP(A111,'[5] Balance Distribution'!$A:$C,3,FALSE),\"\")","v":27290632.640000023}]
["$50,001 - $75,000","$ 50,001 to $75,000",null,null,0.11112488148864204,{"$f":"IFERROR(VLOOKUP(A112,'[5] Balance Distribution'!$A:$C,3,FALSE),\"\")","v":30567802.850000013}]
["$75,001 - $100,000","$ 75,001 to $100,000",null,null,9.67294360358191E-2,{"$f":"IFERROR(VLOOKUP(A113,'[5] Balance Distribution'!$A:$C,3,FALSE),\"\")","v":26607959.360000014}]
["$100,001 - $125,000","$100,001 to $125,000",null,null,9.6812115909297961E-2,{"$f":"IFERROR(VLOOKUP(A114,'[5] Balance Distribution'!$A:$C,3,FALSE),\"\")","v":26630702.620000008}]
["$125,001 - $150,000","$125,001 to $150,000",null,null,8.9536094151104556E-2,{"$f":"IFERROR(VLOOKUP(A115,'[5] Balance Distribution'!$A:$C,3,FALSE),\"\")","v":24629242.679999992}]
["$150,001 - $200,000","$150,000 to $200,000",null,null,0.12195206031710987,{"$f":"IFERROR(VLOOKUP(A116,'[5] Balance Distribution'!$A:$C,3,FALSE),\"\")","v":33546101.349999998}]
["$200,001 - $300,000","$200,001 to $300,000",null,null,0.20571595222786784,{"$f":"IFERROR(VLOOKUP(A117,'[5] Balance Distribution'!$A:$C,3,FALSE),\"\")","v":56587548.950000048}]
["$300,001 - $400,000","$300,001 to $400,000",null,null,6.6937862135734841E-2,{"$f":"IFERROR(VLOOKUP(A118,'[5] Balance Distribution'!$A:$C,3,FALSE),\"\")","v":18413008.369999997}]
["$400,001 - $500,000","$400,001 to $500,000",null,null,3.0528967532383763E-2,{"$f":"IFERROR(VLOOKUP(A119,'[5] Balance Distribution'!$A:$C,3,FALSE),\"\")","v":8397790.3800000008}]
["$500,001+","$500,000+",null,null,3.2448132315261079E-2,{"$f":"IFERROR(VLOOKUP(A120,'[5] Balance Distribution'!$A:$C,3,FALSE),\"\")","v":8925706.8100000005}]
{"$rows_left_out":128}
{"sheet":"Note Balance","index":1,"n_rows":20,"n_cols":9,"rows_kept":20,"cut":false,"hidden":false,"merged":[]}
[null,null,"TOTAL NOTE BALANCES"]
[null,null,null,"Total Notes","Class A1 Notes","Class A2 Notes","Class B Notes","Class C Notes","Class D Notes"]
[null,null,"Initial Invested Amount",350000000,105000000,198000000,11300000,10500000,6200000]
["(a)",null,"Invested Amount as at Previous Payment Date:  3 March 2016",350000000,105000000,198000000,11300000,10500000,6200000]
["(b)",null,"Stated Amount as at Previous Payment Date:  3 March 2016",350000000,105000000,198000000,11300000,10500000,6200000]
["(d)",null,"Principal Payments to Noteholders on Payment Date",350000000,74839799.260000005,0,0,0,0]
[null,null,"Gross Aggregate Charge-Offs",0,0,0,0,0,0]
[null,null,"Gross Aggregate Reinstatements of charge-offs",0,0,0,0,0,0]
["(e)",null,"Aggregate Charge-Offs for this Collection Period",84066.21,0,0,0,0,0]
["(f)",null,"Reinstatements relating to Charge-offs that have occurred this Collection Period",0,0,0,0,0,0]
[null,null,"Aggregate Carry Over Charge-offs not previously reinstated",0,0,0,0,0,0]
[null,null,"Reinstatements of Carry Over Charge-offs not previously reinstated",0,0,0,0,0,0]
[null,null,"Aggregate Charge-Offs not reinstated and to be carried over to next period",84066.21,0,0,0,0,0]
[null,null,"Invested Amount as at Payment Date:  16 May 2016",275160200.74000001,30160200.739999995,198000000,11300000,10500000,6200000]
[null,null,"Stated Amount as at Payment Date:  16 May 2016",275076134.53000003,30160200.739999995,198000000,11300000,10500000,6200000]
[null,null,"Bond Factor at Payment Date:  16 May 2016",null,0.28724000704761898,1,1,1,1]
[null,null,"Coupon Margin",null,6.0000000000000001E-3,1.2999999999999999E-2,0.02,2.5000000000000001E-2,2.4500000000000001E-2]
[null,null,"Coupon Rate (3 month BBSW + margin)",null,2.9100000000000001E-2,3.61E-2,4.3099999999999999E-2,4.8100000000000004E-2,4.7600000000000003E-2]
[null,null,"Days in Coupon Period",null,74,74,74,74,74]
[null,null,"Coupon Entitlement to be paid out on the current Payment Date: 16 May 2016",null,619471.23,1449143.01,98740.33,102393.7,59832.55]

{"sheet":"Cumulative Defaults","index":2,"n_rows":14,"n_cols":4,"rows_kept":14,"cut":false,"hidden":false,"merged":[]}
["Cumulative Defaults & Losses"]
[]
["Month","Gross Losses","Recoveries","Net Losses"]
["2016-04-01",{"$f":"'Collateral Tables'!E9/350000000","v":2.4018917142857145E-4},{"$f":"'Collateral Tables'!E23/350000000","v":0},{"$f":"B4-C4","v":2.4018917142857145E-4}]
["2016-07-01"]
["2016-10-01"]
["2017-01-01"]
["2017-04-01"]
["2017-07-01"]
["2017-10-01"]
["2018-01-01"]
["2018-04-01"]
["2018-07-01"]
["2018-10-01"]