{"text_format":"1","workbook":"xlsx","n_sheets":3,"sheets":["Collateral Tables ","Note Balance","Cumulative Defaults"],"not_rendered":{"charts":1,"images":0,"macros":1,"external_links":6,"defined_names":24,"comments":1,"pivot_tables":0},"unopened":[],"bounds":{"document_bytes":16777216,"sheet_cells":100000,"rows_first":2000,"rows_last":500,"rows_between":2000,"halvings":0,"cell_chars":16384,"cell_head_chars":4096},"cells_cut":0,"cells_raw":0,"read":"whole","date_system":"1900"}

{"sheet":"Collateral Tables ","index":0,"n_rows":247,"n_cols":11,"rows_kept":247,"cut":false,"hidden":false,"merged":[]}
[null,"CNH CAPITAL AUSTRALIA RECEIVABLES TRUST SERIES 2016-1 (TERM DEAL)"]
[null,"COLLATERAL DATA TABLES"]
[]
[null,"OUTSTANDING RECEIVABLES",null,null,"2016-07-31",null,null,null,"2016-04-30"]
[]
[null,"Opening Balance",null,null,{"$f":"I13","v":275076134.53000009},null,null,null,349999833.42000002]
[null,"Principal Repayments - Scheduled",null,null,{"$f":"MIN('[1]16 Aug 16'!$H23,SUM([2]Sheet1!$B$3,[2]Sheet1!$B$4,[3]Sheet1!$B$3))","v":18368178.68},null,null,null,70539694.680000007]
[null,"Principal Repayments - Unscheduled",null,null,{"$f":"'[1]16 Aug 16'!H23-'Collateral Tables '!E7","v":2981303.9900000058},null,null,null,4299937.9999999255]
[{"$f":"SUM(E9:I9)","v":439714.14},"Charge-Offs",null,null,{"$f":"'[1]16 Aug 16'!$H37","v":355647.93},null,null,null,84066.21]
[null,"Reinstatements"]
[null,"New Receivables Purchased"]
[null,"Non Cash Change in Receivables"]
[null,"Closing Balance",null,null,{"$f":"E6-E7-E8-E9+E10+E11-E12","v":253371003.93000007},null,null,null,275076134.53000009]
[]
[null,"PORTFOLIO STATISTICS"]
[]
[null,"Summary"]
[null,"Number of contracts",null,null,{"$f":"[4]Summary!$B$4","v":3263},null,null,null,3422]
[null,"Dollar value of contracts",null,null,{"$f":"[4]Summary!$B$6","v":77649.710061293183},null,null,null,80384.609739918029]
[null,"Number of contracts closed during the Quarter",null,null,{"$f":"[4]Summary!$B$19","v":157},null,null,null,216]
[null,"Dollar value of contracts closed during the Quarter",null,null,{"$f":"[4]Summary!$B$20","v":5997812.8599999985},null,null,null,10129289.880000003]
[]
[{"$f":"SUM(I23)","v":0},"Dollar Value of Recoveries from Collateral",null,null,{"$f":"[4]Summary!$C$16","v":-8677.59},null,null,null,0]
[null,"Dollar Value of Recoveries from Other Sources",null,null,0,null,null,null,0]
[]
[null,"Average Term of Contracts (Months)",null,null,{"$f":"[5]Sheet1!$W$3265","v":50.905018498380905},null,null,null,50.602561692977268]
[null,"Average Term to Maturity (Months)",null,null,{"$f":"[5]Sheet1!$X$3265","v":31.261824556602878},null,null,null,33.580143025830573]
[null,"Average Residual / Balloon Payment *",null,null,{"$f":"[5]Sheet1!$AI$3265","v":2.2629991788590827E-2},null,null,null,2.4040809082651878E-2]
[null,"Average Seasoning (Months)",null,null,{"$f":"E26-E27","v":19.643193941778026},null,null,null,17.022418667146695]
[null,"Average Dollar Value of Individual Assets",null,null,{"$f":"E19/E18","v":23.797030358962054},null,null,null,23.490534698982476]
[null,"Weighted Average Interest Rate",null,null,{"$f":"[5]Sheet1!$AA$3265/100","v":3.6462237991813522E-2},null,null,null,3.6655471442132145E-2]
[]
[null,"Payment in Arrears"]
["1. 0 - 30 Days","0 - 30 Days",null,null,{"$f":"IFERROR(VLOOKUP($A34,'[6]Arrears Reporting'!$A$1:$D$6,3,FALSE),0)","v":3255},{"$f":"IFERROR(VLOOKUP($A34,'[6]Arrears Reporting'!$A$1:$D$5,2,FALSE),0)","v":120639.01000000001},{"$f":"F34/F$50","v":4.7613581715660603E-4},null,3409,279917.05,1.0175984567991395E-3]
["2. 31 - 60 Days","31 - 60 Days",null,null,{"$f":"IFERROR(VLOOKUP($A35,'[6]Arrears Reporting'!$A$1:$D$6,3,FALSE),0)","v":3},{"$f":"IFERROR(VLOOKUP($A35,'[6]Arrears Reporting'!$A$1:$D$5,2,FALSE),0)","v":46074.110000000015},{"$f":"F35/F$50","v":1.8184444662313923E-4},null,8,230113.48,8.3654469113860581E-4]
["3. 61 - 90 Days","61 - 90 Days",null,null,{"$f":"IFERROR(VLOOKUP($A36,'[6]Arrears Reporting'!$A$1:$D$6,3,FALSE),0)","v":4},{"$f":"IFERROR(VLOOKUP($A36,'[6]Arrears Reporting'!$A$1:$D$5,2,FALSE),0)","v":60199.999999999971},2.3759624845087562E-4,null,3,35237.550000000097,1.2810108030712178E-4]
["4. 91 - 120 Days","91 - 120 Days",null,null,{"$f":"IFERROR(VLOOKUP($A37,'[6]Arrears Reporting'!$A$1:$D$6,3,FALSE),0)","v":0},{"$f":"IFERROR(VLOOKUP($A37,'[6]Arrears Reporting'!$A$1:$D$5,2,FALSE),0)","v":0},0,null,1,48099.140000000007,1.7485755382662749E-4]
["5. 121 - 150 Days","121 - 150 Days",null,null,{"$f":"IFERROR(VLOOKUP($A38,'[6]Arrears Reporting'!$A$1:$D$6,3,FALSE),0)","v":1},{"$f":"IFERROR(VLOOKUP($A38,'[6]Arrears Reporting'!$A$1:$D$5,2,FALSE),0)","v":5363.4499999999989},2.1168365427804805E-5,null,1,30045.720000000012,1.09226923852688E-4]
["6. 151 - 180 Days","151 - 180 Days",null,null,{"$f":"IFERROR(VLOOKUP($A39,'[6]Arrears Reporting'!$A$1:$D$6,3,FALSE),0)","v":0},{"$f":"IFERROR(VLOOKUP($A39,'[6]Arrears Reporting'!$A$1:$D$5,2,FALSE),0)","v":0},0,null,0,0,0]
[null,"Total",null,null,{"$f":"SUM(E34:E39)","v":3263},{"$f":"SUM(F34:F39)","v":232276.57},{"$f":"SUM(G34:G39)","v":9.1674487765842569E-4},null,3422,623412.94000000006,2.2663287059241826E-3]
[null,"* Expressed as a % of Aggreg. Rec. closing bal.",null,null,null,"> 30 days",{"$f":"SUM(G35:G39)","v":4.406090605018196E-4},null,null,"> 30 days",1.2487302491250431E-3]
[]
[" 0 - 30 Days","Account Balances in Arrears"]
["1. 0 - 30 Days","0 - 30 Days",null,null,{"$f":"IFERROR(VLOOKUP($A44,'[6]Arrears Reporting'!$A$1:$D$6,3,FALSE),0)","v":3255},{"$f":"IFERROR(VLOOKUP($A44,'[6]Arrears Reporting'!$A$1:$D$6,4,FALSE),0)","v":252870428.10999963},{"$f":"F44/F$50","v":0.99802433659639167},null,3409,273901148.7699995,0.99572850708402028]
["2. 31 - 60 Days","31 - 60 Days",null,null,{"$f":"IFERROR(VLOOKUP($A45,'[6]Arrears Reporting'!$A$1:$D$6,3,FALSE),0)","v":3},{"$f":"IFERROR(VLOOKUP($A45,'[6]Arrears Reporting'!$A$1:$D$6,4,FALSE),0)","v":122576.48000000001},{"$f":"F45/F$50","v":4.8378258797863457E-4},null,8,698753.64,2.5402190604208695E-3]
["3. 61 - 90 Days","61 - 90 Days",null,null,{"$f":"IFERROR(VLOOKUP($A46,'[6]Arrears Reporting'!$A$1:$D$6,3,FALSE),0)","v":4},{"$f":"IFERROR(VLOOKUP($A46,'[6]Arrears Reporting'!$A$1:$D$6,4,FALSE),0)","v":366338.57999999996},1.4458583433691198E-3,null,3,107754.56,3.9172631309550559E-4]
["4. 91 - 120 Days","91 - 120 Days",null,null,{"$f":"IFERROR(VLOOKUP($A47,'[6]Arrears Reporting'!$A$1:$D$6,3,FALSE),0)","v":0},{"$f":"IFERROR(VLOOKUP($A47,'[6]Arrears Reporting'!$A$1:$D$6,4,FALSE),0)","v":0},{"$f":"F47/F$50","v":0},null,1,84424.18,3.0691204871061899E-4]
["5. 121 - 150 Days","121 - 150 Days",null,null,{"$f":"IFERROR(VLOOKUP($A48,'[6]Arrears Reporting'!$A$1:$D$6,3,FALSE),0)","v":1},{"$f":"IFERROR(VLOOKUP($A48,'[6]Arrears Reporting'!$A$1:$D$6,4,FALSE),0)","v":11660.76},{"$f":"F48/F$50","v":4.6022472260565345E-5},null,1,284053.38,1.0326354937528085E-3]
["6. 151 - 180 Days","151 - 180 Days",null,null,{"$f":"IFERROR(VLOOKUP($A49,'[6]Arrears Reporting'!$A$1:$D$6,3,FALSE),0)","v":0},{"$f":"IFERROR(VLOOKUP($A49,'[6]Arrears Reporting'!$A$1:$D$6,4,FALSE),0)","v":0},0,null,0,0,0]
[null,"Total",null,null,{"$f":"SUM(E44:E49)","v":3263},{"$f":"SUM(F44:F49)","v":253371003.92999962},{"$f":"SUM(G44:G49)","v":1},null,3422,275076134.52999949,1]
["NSW",null,null,null,null,"> 30 days",{"$f":"SUM(G45:G49)","v":1.9756634036083198E-3},null,null,"> 30 days",4.2714929159798024E-3]
[null,null,null,null,null,">90 days",{"$f":"SUM(G47:G49)","v":4.6022472260565345E-5},null,null,">90 days",1.3395475424634274E-3]
[]
["VIC","Geographic Distribution"]
["NSW","New South Wales",null,null,{"$f":"F55/F$63","v":0.29110503718246078},{"$f":"IFERROR(VLOOKUP($A$55,'[6]Geographic '!$A$1:$C$10,3,FALSE),0)","v":73757575.520000115},null,null,0.29705376436823705,81712401.250000164]
["VIC","Victoria",null,null,{"$f":"F56/F$63","v":0.17529086308656849},{"$f":"IFERROR(VLOOKUP($A$56,'[6]Geographic '!$A$1:$C$10,3,FALSE),0)","v":44413621.960000068},null,null,0.18022488506574988,49575564.730000041]
["QLD","Queensland",null,null,0.11345624631120736,{"$f":"IFERROR(VLOOKUP($A$57,'[6]Geographic '!$A$1:$C$10,3,FALSE),0)","v":28746523.02999999},null,null,0.11757327303315286,32341601.470000003]
["SA","South Australia",null,null,0.18459924361716598,{"$f":"IFERROR(VLOOKUP($A$58,'[6]Geographic '!$A$1:$C$10,3,FALSE),0)","v":46772095.680000022},null,null,0.17919394619319157,49291978.049999982]
["NT","Northern Territory",null,null,4.1777795548082671E-4,{"$f":"IFERROR(VLOOKUP($A$59,'[6]Geographic '!$A$1:$C$10,3,FALSE),0)","v":105852.81999999999},null,null,3.848128089369219E-4,105852.81999999999]
["ACT","Australian Capital Territory",null,null,2.2047574163392924E-4,{"$f":"IFERROR(VLOOKUP($A$60,'[6]Geographic '!$A$1:$C$10,3,FALSE),0)","v":55862.159999999989},null,null,2.2276559943922353E-4,61277.499999999993]
["TAS","Tasmania",null,null,8.8499200193384916E-3,{"$f":"IFERROR(VLOOKUP($A$61,'[6]Geographic '!$A$1:$C$10,3,FALSE),0)","v":2242313.12},null,null,9.7943024559484972E-3,2694178.8600000003]
["WA","Western Australia",null,null,0.22606043608614426,{"$f":"IFERROR(VLOOKUP($A$62,'[6]Geographic '!$A$1:$C$10,3,FALSE),0)","v":57277159.640000015},null,null,0.21555225047534396,59293279.850000016]
[null,"Total",null,null,{"$f":"SUM(E55:E62)","v":1.0000000000000002},{"$f":"SUM(F55:F62)","v":253371003.93000019},null,null,0.99999999999999989,275076134.53000021]
["AG",null,null,null,null,null,{"$f":"E13-F63","v":0},null,null,null,275076134.53000009]
["CE","Top Industry Distribution"]
["AGRICULTURAL MACHINERY","Agricultural",null,null,{"$f":"F66/F$69","v":0.98669367201571556},{"$f":"IFERROR(VLOOKUP(A66,'[6]Top Industry'!$A$1:$C$5,3,FALSE),)","v":249999566.24999967},null,null,0.9852200432911179,271010521.1699996]
["CONSTRUCTION EQUIPMENT","Construction",null,null,{"$f":"F67/F$69","v":1.3306327984284449E-2},{"$f":"IFERROR(VLOOKUP($A$67,'[6]Top Industry'!$A$1:$C$5,3,FALSE),)","v":3371437.6799999997},null,null,1.4779956708882014E-2,4065613.3599999994]
["MOTOR VEHICLE - AG","Motor Vehicle AG",null,null,{"$f":"F68/F$69","v":0},{"$f":"IFERROR(VLOOKUP($A$68,'[6]Top Industry'!$A$1:$C$5,3,FALSE),)","v":0},null,null,0,0]
[null,"Total",null,null,{"$f":"SUM(E66:E68)","v":1},{"$f":"SUM(F66:F68)","v":253371003.92999968},{"$f":"F63-F69","v":5.0663948059082031E-7},null,0.99999999999999989,275076134.52999961,-275076134.52999961]
["COMBINE"]
["40-100 HP TRACTOR","Collateral Types"]
["100<140 HP TRACTOR","100-140 HP TRACTOR",null,null,{"$f":"IFERROR(F72/F$107,0)","v":0.1031342088663761},{"$f":"IFERROR(VLOOKUP($A$72,[6]Collateral!$A$1:$C$30,3,FALSE),\"\")","v":26131218.040000021},null,null,0.10702894513296701,29441108.51000002]
["4 EWD Tractors","4 EWD Tractors",null,null,0.1081672270106003,{"$f":"IFERROR(VLOOKUP($A$73,[6]Collateral!$A$1:$C$30,3,FALSE),\"\")","v":27406438.900000013},null,null,0.10816969673083333,29754902.050000008]
["40<100 HP Tractor","40<100 HP Tractor",null,null,{"$f":"IFERROR(F74/F$107,0)","v":0},{"$f":"IFERROR(VLOOKUP($A$74,[6]Collateral!$A$1:$C$30,3,FALSE),\"\")","v":""},null,null,0,""]
["40<60 HP TRACTOR","40-60 HP TRACTOR",null,null,{"$f":"IFERROR(F75/F$107,0)","v":7.5032547154654967E-3},{"$f":"IFERROR(VLOOKUP($A$75,[6]Collateral!$A$1:$C$30,3,FALSE),\"\")","v":1901107.1799999995},null,null,8.2621937518615757E-3,2272732.3199999998]
["4WD VEHICLE","4WD VEHICLE",null,null,7.2201829397392775E-5,{"$f":"IFERROR(VLOOKUP($A$76,[6]Collateral!$A$1:$C$30,3,FALSE),\"\")","v":18293.849999999995},null,null,8.1090059078052425E-5,22305.939999999995]
["60<100 HP TRACTOR","60-100 HP TRACTOR",null,null,6.3897213252045268E-2,{"$f":"IFERROR(VLOOKUP($A$77,[6]Collateral!$A$1:$C$30,3,FALSE),\"\")","v":16189701.07000001},null,null,6.7368036277167365E-2,18531339.010000009]
["Backhoes","Backhoes",null,null,5.3357810445172499E-4,{"$f":"IFERROR(VLOOKUP($A$78,[6]Collateral!$A$1:$C$30,3,FALSE),\"\")","v":135193.21999999997},null,null,5.5525191329654385E-4,152736.54999999999]
["BALERS, WINDROWERS, MOWERS, RAKES","BALERS, WINDROWERS, MOWERS, RAKES",null,null,3.8811712735356309E-2,{"$f":"IFERROR(VLOOKUP($A$79,[6]Collateral!$A$1:$C$30,3,FALSE),\"\")","v":9833762.6199999955},null,null,3.8551025293848094E-2,10604467.01999999]
["QUAD BIKES","QUAD BIKES",null,null,3.2280489373833919E-5,{"$f":"IFERROR(VLOOKUP($A$80,[6]Collateral!$A$1:$C$30,3,FALSE),\"\")","v":8178.9399999999969},null,null,3.3626544941110479E-5,9249.8599999999951]
["Combines","Combines",null,null,0.35462537021333246,{"$f":"IFERROR(VLOOKUP($A$81,[6]Collateral!$A$1:$C$30,3,FALSE),\"\")","v":89851786.069999963},null,null,0.34717658732253526,95499993.639999986]
["TRUCK - on Farm","TRUCK - on Farm",null,null,0,{"$f":"IFERROR(VLOOKUP($A$82,[6]Collateral!$A$1:$C$30,3,FALSE),\"\")","v":""},null,null,7.0909568484839601E-5,19505.529999999984]
["Cotton Pickers","Cotton Pickers",null,null,2.1506987443225701E-4,{"$f":"IFERROR(VLOOKUP($A$83,[6]Collateral!$A$1:$C$30,3,FALSE),\"\")","v":54492.47},null,null,1.9809959192972816E-4,54492.47]
["CRAWLERS / DOZERS","CRAWLERS / DOZERS",null,null,0,{"$f":"IFERROR(VLOOKUP($A$84,[6]Collateral!$A$1:$C$30,3,FALSE),\"\")","v":""},null,null,0,""]
["CULTIVATORS,SEEDERS, HARROWS","CULTIVATORS,SEEDERS, HARROWS",null,null,1.4877028474187173E-2,{"$f":"IFERROR(VLOOKUP($A$85,[6]Collateral!$A$1:$C$30,3,FALSE),\"\")","v":3769407.64},null,null,1.4343276441416268E-2,3945493.0400000005]
["Drill","Drill",null,null,5.8151196354222859E-4,{"$f":"IFERROR(VLOOKUP($A$86,[6]Collateral!$A$1:$C$30,3,FALSE),\"\")","v":147338.27000000002},null,null,6.3340747570741303E-4,174235.28000000003]
["DUMP TRUCKS","DUMP TRUCKS",null,null,0,{"$f":"IFERROR(VLOOKUP($A$87,[6]Collateral!$A$1:$C$30,3,FALSE),\"\")","v":""},null,null,0,""]
["EXCAVATORS / GRADERS","EXCAVATORS / GRADERS",null,null,4.5049112262085973E-3,{"$f":"IFERROR(VLOOKUP($A$88,[6]Collateral!$A$1:$C$30,3,FALSE),\"\")","v":1141413.8799999997},null,null,5.0805466726070482E-3,1397537.1400000001]
["FEEDERS, MIXERS, WAGONS, BINS, FEED STORAGE","FEEDERS, MIXERS, WAGONS, BINS, FEED STORAGE",null,null,2.8129264949232503E-3,{"$f":"IFERROR(VLOOKUP($A$89,[6]Collateral!$A$1:$C$30,3,FALSE),\"\")","v":712714.01},null,null,2.7273481259355841E-3,750228.38]
["Front End Loader","Front End Loader",null,null,4.3116030763402273E-4,{"$f":"IFERROR(VLOOKUP($A$90,[6]Collateral!$A$1:$C$30,3,FALSE),\"\")","v":109243.51999999999},null,null,5.463704448835379E-4,150293.47]
["Fronts","Fronts",null,null,3.9455556653838287E-3,{"$f":"IFERROR(VLOOKUP($A$91,[6]Collateral!$A$1:$C$30,3,FALSE),\"\")","v":999689.39999999991},null,null,3.9743435099084167E-3,1093247.0499999998]
["GUIDANCE SYSTEMS","Guidance Systems",null,null,0,{"$f":"IFERROR(VLOOKUP($A$92,[6]Collateral!$A$1:$C$30,3,FALSE),\"\")","v":""},null,null,0,""]
["HARVESTERS - Other","HARVESTERS - Other",null,null,3.0498564871830791E-3,{"$f":"IFERROR(VLOOKUP($A$93,[6]Collateral!$A$1:$C$30,3,FALSE),\"\")","v":772745.2},null,null,2.8119371799433289E-3,773496.80999999994]
["Irrigation Equipment","Irrigation Equipment",null,null,9.053550581635412E-4,{"$f":"IFERROR(VLOOKUP($A$94,[6]Collateral!$A$1:$C$30,3,FALSE),\"\")","v":229390.71999999997},null,null,8.339172003850537E-4,229390.71999999997]
["Other AG","Other AG",null,null,5.6552530785877429E-3,{"$f":"IFERROR(VLOOKUP($A$95,[6]Collateral!$A$1:$C$30,3,FALSE),\"\")","v":1432877.1499999997},null,null,5.6825801797411929E-3,1563142.1899999997]
["MATERIALS HANDLING EQUIPMENT","MATERIALS HANDLING EQUIPMENT",null,null,2.3012392537272603E-4,{"$f":"IFERROR(VLOOKUP($A$96,[6]Collateral!$A$1:$C$30,3,FALSE),\"\")","v":58306.729999999996},null,null,2.5077831676625022E-4,68983.12999999999]
["Other CE","Other CE",null,null,5.8057799715961365E-4,{"$f":"IFERROR(VLOOKUP($A$97,[6]Collateral!$A$1:$C$30,3,FALSE),\"\")","v":147101.63},null,null,9.7246597003792796E-4,267502.18]
["Over 100 HP Tractor","Over 100 HP Tractor",null,null,0,{"$f":"IFERROR(VLOOKUP($A$98,[6]Collateral!$A$1:$C$30,3,FALSE),\"\")","v":""},null,null,0,""]
["OVER 140 HP TRACTOR","OVER 140 HP TRACTOR",null,null,0.21029926587306322,{"$f":"IFERROR(VLOOKUP($A$99,[6]Collateral!$A$1:$C$30,3,FALSE),\"\")","v":53283736.12000002},null,null,0.21130998019626707,58126332.539999992]
["Rollers","Rollers",null,null,0,{"$f":"IFERROR(VLOOKUP($A$100,[6]Collateral!$A$1:$C$30,3,FALSE),\"\")","v":""},null,null,0,""]
["SCRAPERS","SCRAPERS",null,null,2.7125578276110835E-4,{"$f":"IFERROR(VLOOKUP($A$101,[6]Collateral!$A$1:$C$30,3,FALSE),\"\")","v":68728.350000000006},null,null,2.7464425486813972E-4,75548.08]
["SKIDSTEER / UNILOADER","SKIDSTEER / UNILOADER",null,null,6.8213900296085076E-3,{"$f":"IFERROR(VLOOKUP($A$102,[6]Collateral!$A$1:$C$30,3,FALSE),\"\")","v":1728342.44},null,null,7.2801913311079866E-3,2002606.8900000001]
["SPRAYING EQUIPMENT","SPRAYING EQUIPMENT",null,null,6.5009310909746584E-2,{"$f":"IFERROR(VLOOKUP($A$103,[6]Collateral!$A$1:$C$30,3,FALSE),\"\")","v":16471474.369999995},null,null,6.2545564119535171E-2,17204792.009999998]
["Trenchers","Trenchers",null,null,0,{"$f":"IFERROR(VLOOKUP($A$104,[6]Collateral!$A$1:$C$30,3,FALSE),\"\")","v":""},null,null,0,""]
["Under 40 HP Tractors","Under 40 HP Tractors",null,null,2.6679087169215058E-3,{"$f":"IFERROR(VLOOKUP($A$105,[6]Collateral!$A$1:$C$30,3,FALSE),\"\")","v":675970.71000000008},null,null,2.8711081437487146E-3,789773.33]
["Wheel Loaders","Wheel Loaders",null,null,3.6449091872215329E-4,{"$f":"IFERROR(VLOOKUP($A$106,[6]Collateral!$A$1:$C$30,3,FALSE),\"\")","v":92351.430000000008},null,null,3.660782501981017E-4,100699.39000000001]
[null,"Total",null,null,{"$f":"SUM(E72:E106)","v":0.99999999999999989},{"$f":"SUM(F72:F106)","v":253371003.93000001},{"$f":"F69-F107","v":-3.2782554626464844E-7},null,1.0000000000000002,275076134.52999997,0]
["$ 0 - $25,000"]
["$ 25,001 to $50,000","Contract Balance Distribution"]
["$0 - $25,000","$ 0 - $25,000",null,null,{"$f":"IFERROR(F110/F$121,0)","v":5.3393036141331653E-2},{"$f":"IFERROR(VLOOKUP($A$110,'[6] Balance Distribution'!$A$1:$C$13,3,FALSE),\"\")","v":13528247.169999976},null,null,4.9003300642680409E-2,13479638.519999996]
["$25,001 - $50,000","$ 25,001 to $50,000",null,null,{"$f":"IFERROR(F111/F$121,0)","v":0.10454796969316318},{"$f":"IFERROR(VLOOKUP($A$111,'[6] Balance Distribution'!$A$1:$C$13,3,FALSE),\"\")","v":26489424.039999973},null,null,9.9211197244098534E-2,27290632.640000023]
["$50,001 - $75,000","$ 50,001 to $75,000",null,null,0.11092138873067157,{"$f":"IFERROR(VLOOKUP($A$112,'[6] Balance Distribution'!$A$1:$C$13,3,FALSE),\"\")","v":28104263.620000049},null,null,0.11112488148864204,30567802.850000013]
["$75,001 - $100,000","$ 75,001 to $100,000",null,null,9.7541995400657389E-2,{"$f":"IFERROR(VLOOKUP($A$113,'[6] Balance Distribution'!$A$1:$C$13,3,FALSE),\"\")","v":24714313.300000008},null,null,9.67294360358191E-2,26607959.360000014]
["$100,001 - $125,000","$100,001 to $125,000",null,null,9.5646216552448288E-2,{"$f":"IFERROR(VLOOKUP($A$114,'[6] Balance Distribution'!$A$1:$C$13,3,FALSE),\"\")","v":24233977.910000011},null,null,9.6812115909297961E-2,26630702.620000008]
["$125,001 - $150,000","$125,001 to $150,000",null,null,8.7528803556886123E-2,{"$f":"IFERROR(VLOOKUP($A$115,'[6] Balance Distribution'!$A$1:$C$13,3,FALSE),\"\")","v":22177260.829999994},null,null,8.9536094151104556E-2,24629242.679999992]
["$150,001 - $200,000","$150,000 to $200,000",null,null,0.12386445711313716,{"$f":"IFERROR(VLOOKUP($A$116,'[6] Balance Distribution'!$A$1:$C$13,3,FALSE),\"\")","v":31383661.849999998},null,null,0.12195206031710987,33546101.349999998]
["$200,001 - $300,000","$200,001 to $300,000",null,null,0.20142154728999512,{"$f":"IFERROR(VLOOKUP($A$117,'[6] Balance Distribution'!$A$1:$C$13,3,FALSE),\"\")","v":51034379.650000043},null,null,0.20571595222786784,56587548.950000048]
["$300,001 - $400,000","$300,001 to $400,000",null,null,6.9209609023946031E-2,{"$f":"IFERROR(VLOOKUP($A$118,'[6] Balance Distribution'!$A$1:$C$13,3,FALSE),\"\")","v":17535708.119999997},null,null,6.6937862135734841E-2,18413008.369999997]
["$400,001 - $500,000","$400,001 to $500,000",null,null,2.4220888400061202E-2,{"$f":"IFERROR(VLOOKUP($A$119,'[6] Balance Distribution'!$A$1:$C$13,3,FALSE),\"\")","v":6136870.8099999996},null,null,3.0528967532383763E-2,8397790.3800000008]
["$500,001+","$500,000+",null,null,3.1704088097702317E-2,{"$f":"IFERROR(VLOOKUP($A$120,'[6] Balance Distribution'!$A$1:$C$13,3,FALSE),\"\")","v":8032896.6300000008},null,null,3.2448132315261079E-2,8925706.8100000005]
{"$rows_left_out":128}
{"sheet":"Note Balance","index":1,"n_rows":42,"n_cols":9,"rows_kept":42,"cut":false,"hidden":false,"merged":[]}
[null,null,"TOTAL NOTE BALANCES"]
[null,null,null,"Total Notes","Class A1 Notes","Class A2 Notes","Class B Notes","Class C Notes","Class D Notes"]
[null,null,"Initial Invested Amount",350000000,105000000,198000000,11300000,10500000,6200000]
["(a)",null,"Invested Amount as at Previous Payment Date:  3 March 2016",350000000,105000000,198000000,11300000,10500000,6200000]
["(b)",null,"Stated Amount as at Previous Payment Date:  3 March 2016",350000000,105000000,198000000,11300000,10500000,6200000]
["(d)",null,"Principal Payments to Noteholders on Payment Date",350000000,74839799.260000005,0,0,0,0]
[null,null,"Gross Aggregate Charge-Offs",0,0,0,0,0,0]
[null,null,"Gross Aggregate Reinstatements of charge-offs",0,0,0,0,0,0]
["(e)",null,"Aggregate Charge-Offs for this Collection Period",84066.21,0,0,0,0,0]
["(f)",null,"Reinstatements relating to Charge-offs that have occurred this Collection Period",0,0,0,0,0,0]
[null,null,"Aggregate Carry Over Charge-offs not previously reinstated",0,0,0,0,0,0]
[null,null,"Reinstatements of Carry Over Charge-offs not previously reinstated",0,0,0,0,0,0]
[null,null,"Aggregate Charge-Offs not reinstated and to be carried over to next period",84066.21,0,0,0,0,0]
[null,null,"Invested Amount as at Payment Date:  16 May 2016",275160200.74000001,30160200.739999995,198000000,11300000,10500000,6200000]
[null,null,"Stated Amount as at Payment Date:  16 May 2016",275076134.53000003,30160200.739999995,198000000,11300000,10500000,6200000]
[null,null,"Bond Factor at Payment Date:  16 May 2016",null,0.28724000704761898,1,1,1,1]
[null,null,"Coupon Margin",null,6.0000000000000001E-3,1.2999999999999999E-2,0.02,2.5000000000000001E-2,2.4500000000000001E-2]
[null,null,"Coupon Rate (3 month BBSW + margin)",null,2.9100000000000001E-2,3.61E-2,4.3099999999999999E-2,4.8100000000000004E-2,4.7600000000000003E-2]
[null,null,"Days in Coupon Period",null,74,74,74,74,74]
[null,null,"Coupon Entitlement to be paid out on the current Payment Date: 16 May 2016",null,619471.23,1449143.01,98740.33,102393.7,59832.55]
[]
[]
[null,null,"TOTAL NOTE BALANCES"]
[null,null,null,"Total Notes","Class A1 Notes","Class A2 Notes","Class B Notes","Class C Notes","Class D Notes"]
[null,null,"Initial Invested Amount",350000000,105000000,198000000,11300000,10500000,6200000]
["(a)",null,"Invested Amount as at Previous Payment Date:  16 May 2016",350000000,30160200.739999995,198000000,11300000,10500000,6200000]
["(b)",null,"Stated Amount as at Previous Payment Date:  16 May 2016",275160200.74000001,30160200.739999995,198000000,11300000,10500000,6200000]
["(d)",null,"Principal Payments to Noteholders on Payment Date",275076134.53000003,21349482.670000002,0,0,0,0]
[null,null,"Gross Aggregate Charge-Offs",0,0,0,0,0,0]
[null,null,"Gross Aggregate Reinstatements of charge-offs",0,0,0,0,0,0]
["(e)",null,"Aggregate Charge-Offs for this Collection Period",355647.93,0,0,0,0,0]
["(f)",null,"Reinstatements relating to Charge-offs that have occurred this Collection Period",0,0,0,0,0,0]
[null,null,"Aggregate Carry Over Charge-offs not previously reinstated",84066.21,0,0,0,0,0]
[null,null,"Reinstatements of Carry Over Charge-offs not previously reinstated",0,0,0,0,0,0]
[null,null,"Aggregate Charge-Offs not reinstated and to be carried over to next period",439714.14,0,0,0,0,0]
[null,null,"Invested Amount as at Payment Date:  16 August 2016",253810718.06999999,8810718.0699999928,198000000,11300000,10500000,6200000]
[null,null,"Stated Amount as at Payment Date:  16 August 2016",253371003.93000001,8810718.0699999928,198000000,11300000,10500000,6200000]
[null,null,"Bond Factor at Payment Date:  16 August 2016",null,8.39116006666666E-2,1,1,1,1]
[null,null,"Coupon Margin",null,6.0000000000000001E-3,1.2999999999999999E-2,0.02,2.5000000000000001E-2,2.4500000000000001E-2]
[null,null,"Coupon Rate (3 month BBSW + margin)",null,2.5849999999999998E-2,3.2849999999999997E-2,3.9849999999999997E-2,4.4850000000000001E-2,4.4350000000000001E-2]
[null,null,"Days in Coupon Period",null,92,92,92,92,92]
[null,null,"Coupon Entitlement to be paid out on the current Payment Date: 16 August 2016",null,196512.3,1639440,113501.53,118698.9,69307.509999999995]

{"sheet":"Cumulative Defaults","index":2,"n_rows":14,"n_cols":4,"rows_kept":14,"cut":false,"hidden":false,"merged":[]}
["Cumulative Defaults & Losses"]
[]
["Month","Gross Losses","Recoveries","Net Losses"]
["2016-04-01",2.4018917142857145E-4,0,{"$f":"B4-C4","v":2.4018917142857145E-4}]
["2016-07-01",{"$f":"B4+'Collateral Tables '!E9/350000000","v":1.2563261142857142E-3},{"$f":"C4+'Collateral Tables '!E23/350000000","v":-2.4793114285714286E-5},1.2811192285714285E-3]
["2016-10-01"]
["2017-01-01"]
["2017-04-01"]
["2017-07-01"]
["2017-10-01"]
["2018-01-01"]
["2018-04-01"]
["2018-07-01"]
["2018-10-01"]